{"text_format":"2","workbook":"xlsx","n_sheets":6,"sheets":["READ ME","1 Geographic Data","2 Input","3 Output","Calculation Sheet","Systems Table"],"not_rendered":{"charts":5,"images":14,"macros":0,"external_links":0,"defined_names":4,"comments":0,"pivot_tables":0},"unopened":[],"bounds":{"document_bytes":16777216,"sheet_cells":100000,"run_cost":"one","rows_first":2000,"rows_last":500,"rows_between":2000,"halvings":0,"cell_chars":16384,"cell_head_chars":4096},"cells_cut":0,"cells_raw":0,"read":"whole","date_system":"1900"}

{"sheet":"READ ME","index":0,"n_rows":57,"n_cols":6,"rows_kept":57,"cut":false,"hidden":false,"merged":[[51,2,53,8],[56,2,56,8],[40,5,41,8],[42,5,43,8],[44,5,45,8],[46,5,47,8],[46,2,47,4],[40,2,41,4],[42,2,43,4],[44,2,45,4],[49,2,49,8],[38,5,39,8],[19,2,19,7],[17,2,17,8],[21,2,24,8],[27,2,27,8],[36,2,36,8],[38,2,39,4]]}
{"$rows_empty":17}
[null,null,"Read Me Sheet "]
[]
[null,null,"Introduction"]
[]
[null,null,"This tool calculates the required power to cool different products from a given to a desired temperature and gives an economic analysis. Four example systems (described under  http://solar-cooling-engineering.com/example-systems ) can be selected, data will automatically be filled in. It is also possible, to design an own system. "]
[]
[]
[]
[]
[]
[null,null,"Tips & Tricks"]
{"$rows_empty":8}
[null,null,"Overview of the following sheets"]
[]
[null,null,"1. Geographic Data",null,null,"For adding basic site information: ambient temperatures or solar radiation. "]
[]
[null,null,"2. Input",null,null,"For adding data about the product to be cooled under given conditions"]
[]
[null,null,"3. Output",null,null,"For an overview of the results"]
[]
[null,null,"Calculation Sheet (Hidden)",null,null,"All calculations are done within this sheet"]
[]
[null,null,"Systems Table (Hidden)",null,null,"Contains example values of the three sample systems"]
[]
[]
[null,null,"Additional information"]
[]
[null,null,"This tool was created by the solar cooling group of the Institute of  Agricultural Engineering ( Tropics/Subtropics Department) of the University of Hohenheim, Germany. "]
[]
[]
[]
[]
[null,null,"In cooperation with"]

{"sheet":"1 Geographic Data","index":1,"n_rows":11,"n_cols":13,"rows_kept":11,"cut":false,"hidden":false,"merged":[[2,3,2,8],[10,0,10,4],[10,5,10,6],[10,9,10,12]]}
[]
[]
[null,null,null,"1 Geographic Data"]
[]
[]
[]
[null,"January","February","March","April","May","June","July","August","September","October","November","December"]
["Mean daily temperature [°C]:",25,26,26,26,25,23,22,23,24,25,25,25]
["Solar irradiation [kWh/m² day]:",6.2,6.6,6,5.3,4.5999999999999996,4.3,4.4000000000000004,4.7,5.6,5.9,5.6,5.8]
[]
["Use to obtain indicative monthly irradiation and temperature data for the site:",{"$nulls":4},"www.worldclimate.com",null,null,null,"www.sdwebx.worldbank.org/climateportal"]

{"sheet":"2 Input","index":2,"n_rows":57,"n_cols":12,"rows_kept":57,"cut":false,"hidden":false,"merged":[[2,1,2,6],[10,4,10,5],[13,9,13,11],[13,4,13,6]]}
[]
[]
[null,"Input of parameters"]
{"$rows_empty":7}
[null,null,null,"Select System:","Battery-free refrigerator"]
[]
[]
[null,"Product information",null,null,{"$f":"IF(E11='Systems Table'!$D$7, \"Own system data\",'Systems Table'!D9&\" preset data\")","v":"Battery-free refrigerator preset data"},{"$nulls":4},{"$f":"IF(E11='Systems Table'!D7, \"Please put in data\",\"Only required for own system design\")","v":"Only required for own system design"}]
[]
[null,"Total mass to be cooled",null,null,"Mass =",{"$f":"'Systems Table'!N18","v":12},"kg or l",null,null,"Mass =",10,"kg or l"]
[null," Moisture content of the product",null,null,"MC =",{"$f":"'Systems Table'!N19","v":100},"% wet based",null,null,"MC =",100,"% wet based"]
[null," or Heat capacity of the product",null,null,"cp =",{"$f":"'Systems Table'!N20","v":0},"kJ/kg K",null,null,"cp = ",0,"kJ/kg K"]
[]
[]
[null,"Temperature information"]
[]
[null,"Initial temperature of the product",null,null,"Ti =",{"$f":"'Systems Table'!N25","v":25},"°C",null,null,"Ti =",25,"°C"]
[null,"Final temperature of the product",null,null,"Tm =",{"$f":"'Systems Table'!N26","v":4},"°C",null,null,"Tm =",4,"°C"]
[null,"Time to cool down the product",null,null,"t =",{"$f":"'Systems Table'!N27","v":8},"h",null,null,"t =",10,"h"]
[null,"How often do you cool down the product",null,null,null,{"$f":"'Systems Table'!N28","v":30},"per month",null,null,null,30,"per month"]
[]
[]
[null,"System information"]
[]
[null,"Batteries",null,null,null,{"$f":"'Systems Table'!N32","v":"No"},{"$nulls":4},"Yes"]
[null,"Autonomy of the system",null,null,null,{"$f":"'Systems Table'!N33","v":1},{"$f":"IF(K31=\"YES\",\"days\",\"\")","v":"days"},null,null,null,1,{"$f":"IF(K31=\"YES\",\"days\",\"\")","v":"days"}]
[null,"System losses",null,null,null,{"$f":"'Systems Table'!N34","v":30},"%",null,null,null,25,"%"]
[]
[null,"Isolation material"]
[]
[null,"Area of the cooling room",null,null,"A =",{"$f":"'Systems Table'!N38","v":0.9},"m²",null,null,"A =",2,"m²"]
[null,"Thermal conductivity of insulation",null,null,"k /  l =",{"$f":"'Systems Table'!N39","v":3.5000000000000003E-2},"W/m K",null,null,"k /  l =",3.5000000000000003E-2,"W/m K"]
[null,"Thickness of insulation",null,null,"L =",{"$f":"'Systems Table'!N40","v":0.06},"m",null,null,"L =",0.1,"m"]
[]
[]
[null,"Economic information"]
[]
[null,"Currency used for calculation",null,null,null,{"$f":"'Systems Table'!N45","v":"€"},{"$nulls":4},"$"]
[null,"Specific cost of PV",null,null,null,{"$f":"'Systems Table'!N46","v":1.1000000000000001},{"$f":"F44&\"/Wp\"","v":"€/Wp"},null,null,null,1.1000000000000001,{"$f":"K44&\"/Wp\"","v":"$/Wp"}]
[null,"PV lifetime",null,null,null,{"$f":"'Systems Table'!N47","v":21},"years",null,null,null,21,"years"]
{"$rows_left_out":12}
{"sheet":"3 Output","index":3,"n_rows":31,"n_cols":11,"rows_kept":31,"cut":false,"hidden":false,"merged":[[2,1,2,6],[15,1,15,3],[15,7,15,9]]}
[]
[]
[null,"Results"]
[]
[]
[null,"Selected System: ",null,{"$f":"'Systems Table'!D9","v":"Battery-free refrigerator"}]
{"$rows_empty":9}
[null,"System Design without batteries",{"$nulls":5},{"$f":"IF('Systems Table'!N32=\"yes\",\"System Design with batteries\",\"\")","v":""}]
[]
[null,"Cooling units needed:",null,{"$f":"'Calculation Sheet'!$P$17","v":1},null,null,null,{"$f":"IF('Systems Table'!N32=\"yes\",\"Cooling units needed:\",\"\")","v":""},null,{"$f":"IF('Systems Table'!N32=\"yes\",'Calculation Sheet'!$P$19,\"\")","v":""}]
[null,"Cooling units costs:",null,{"$f":"'Calculation Sheet'!$U$70","v":650},{"$f":"'Calculation Sheet'!$E$65","v":"€"},null,null,{"$f":"IF('Systems Table'!N32=\"yes\",\"Cooling units costs:\",\"\")","v":""},null,{"$f":"IF('Systems Table'!N32=\"yes\",'Calculation Sheet'!$P$70,\"\")","v":""},{"$f":"IF('Systems Table'!N32=\"yes\",'Calculation Sheet'!$E$65,\"\")","v":""}]
[]
[null,"Solar PV size:",null,{"$f":"'Calculation Sheet'!$P$18","v":140},"Wp",null,null,{"$f":"IF('Systems Table'!N32=\"yes\",\"Solar PV size:\",\"\")","v":""},null,{"$f":"IF('Systems Table'!N32=\"yes\",'Calculation Sheet'!$P$20,\"\")","v":""},{"$f":"IF('Systems Table'!N32=\"yes\",\"Wp\",\"\")","v":""}]
[null,"Solar PV costs:",null,{"$f":"'Calculation Sheet'!$U$66","v":154},{"$f":"'Calculation Sheet'!$E$65","v":"€"},null,null,{"$f":"IF('Systems Table'!N32=\"yes\",\"Solar PV costs:\",\"\")","v":""},null,{"$f":"IF('Systems Table'!N32=\"yes\",'Calculation Sheet'!$P$66,\"\")","v":""},{"$f":"IF('Systems Table'!N32=\"yes\",'Calculation Sheet'!$E$65,\"\")","v":""}]
[]
[{"$nulls":7},{"$f":"IF('Systems Table'!N32=\"yes\",\"Battery size:\",\"\")","v":""},null,{"$f":"IF('Systems Table'!N32=\"yes\",'Calculation Sheet'!$P$21,\"\")","v":""},{"$f":"IF('Systems Table'!N32=\"yes\",\"Ah @12 V\",\"\")","v":""}]
[{"$nulls":7},{"$f":"IF('Systems Table'!N32=\"yes\",\"Battery costs:\",\"\")","v":""},null,{"$f":"IF('Systems Table'!N32=\"yes\",'Calculation Sheet'!P68,\"\")","v":""},{"$f":"IF('Systems Table'!N32=\"yes\",'Calculation Sheet'!$E$65,\"\")","v":""}]
[]
[]
[null,"Total initial investment",null,{"$f":"'Calculation Sheet'!B126","v":1054},{"$f":"'Calculation Sheet'!E65","v":"€"},null,null,{"$f":"IF('Systems Table'!N32=\"yes\",\"Total initial investment\",\"\")","v":""},null,{"$f":"IF('Systems Table'!N32=\"yes\",'Calculation Sheet'!B100,\"\")","v":""},{"$f":"IF('Systems Table'!N32=\"yes\",'Calculation Sheet'!E65,\"\")","v":""}]
[null,"Payback period:",null,{"$f":"'Calculation Sheet'!B127","v":2.9},"years",null,null,{"$f":"IF('Systems Table'!N32=\"yes\",\"Payback period:\",\"\")","v":""},null,{"$f":"IF('Systems Table'!N32=\"yes\",'Calculation Sheet'!B101,\"\")","v":""},{"$f":"IF('Systems Table'!N32=\"yes\",\"years\",\"\")","v":""}]
[null,"Net present value:",null,{"$f":"'Calculation Sheet'!B128","v":2876.1417354761534},{"$f":"'Calculation Sheet'!E65","v":"€"},null,null,{"$f":"IF('Systems Table'!N32=\"yes\",\"Net present value:\",\"\")","v":""},null,{"$f":"IF('Systems Table'!N32=\"yes\",'Calculation Sheet'!B102,\"\")","v":""},{"$f":"IF('Systems Table'!N32=\"yes\",'Calculation Sheet'!E65,\"\")","v":""}]
[null,"Internal rate of return:",null,{"$f":"'Calculation Sheet'!B129*100","v":33.24404564579622},"%",null,null,{"$f":"IF('Systems Table'!N32=\"yes\",\"Internal rate of return:\",\"\")","v":""},null,{"$f":"IF('Systems Table'!N32=\"yes\",'Calculation Sheet'!B103*100,\"\")","v":""},{"$f":"IF('Systems Table'!N32=\"yes\",\"%\",\"\")","v":""}]

{"sheet":"Calculation Sheet","index":4,"n_rows":129,"n_cols":31,"rows_kept":129,"cut":false,"hidden":true,"merged":[[11,14,11,15],[14,14,14,15]]}
[]
[]
[null,"January","February","March","April","May","June","July","August","September","October","November","December"]
["Mean daily temperature [°C]:",{"$f":"'1 Geographic Data'!B8","v":25},{"$f":"'1 Geographic Data'!C8","v":26},{"$f":"'1 Geographic Data'!D8","v":26},{"$f":"'1 Geographic Data'!E8","v":26},{"$f":"'1 Geographic Data'!F8","v":25},{"$f":"'1 Geographic Data'!G8","v":23},{"$f":"'1 Geographic Data'!H8","v":22},{"$f":"'1 Geographic Data'!I8","v":23},{"$f":"'1 Geographic Data'!J8","v":24},{"$f":"'1 Geographic Data'!K8","v":25},{"$f":"'1 Geographic Data'!L8","v":25},{"$f":"'1 Geographic Data'!M8","v":25}]
["Solar irradiation [kWh/m² day]:",{"$f":"'1 Geographic Data'!B9","v":6.2},{"$f":"'1 Geographic Data'!C9","v":6.6},{"$f":"'1 Geographic Data'!D9","v":6},{"$f":"'1 Geographic Data'!E9","v":5.3},{"$f":"'1 Geographic Data'!F9","v":4.5999999999999996},{"$f":"'1 Geographic Data'!G9","v":4.3},{"$f":"'1 Geographic Data'!H9","v":4.4000000000000004},{"$f":"'1 Geographic Data'!I9","v":4.7},{"$f":"'1 Geographic Data'!J9","v":5.6},{"$f":"'1 Geographic Data'!K9","v":5.9},{"$f":"'1 Geographic Data'!L9","v":5.6},{"$f":"'1 Geographic Data'!M9","v":5.8}]
["Thermal losses for each day [kWh]:",{"$f":"$E$49*$E$52*(B4-$E$39)*24/1000","v":0.2646},{"$f":"$E$49*$E$52*(C4-$E$39)*24/1000","v":0.27720000000000006},0.27720000000000006,0.27720000000000006,0.2646,0.23939999999999997,0.2268,0.23939999999999997,0.252,0.2646,0.2646,0.2646]
["Thermal Energy Liquid phase [kWh]:",{"$f":"$E$27*$E$31*($E$38-MAX($E$39,0))/3600","v":0.29330000000000001},{"$f":"$E$27*$E$31*($E$38-MAX($E$39,0))/3600","v":0.29330000000000001},0.29330000000000001,0.29330000000000001,0.29330000000000001,0.29330000000000001,0.29330000000000001,0.29330000000000001,0.29330000000000001,0.29330000000000001,0.29330000000000001,0.29330000000000001]
["Thermal Energy Change Phase [kWh]:",{"$f":"$E$27*$E$31*80/3600","v":1.1173333333333333},{"$f":"$E$27*$E$31*80/3600","v":1.1173333333333333},1.1173333333333333,1.1173333333333333,1.1173333333333333,1.1173333333333333,1.1173333333333333,1.1173333333333333,1.1173333333333333,1.1173333333333333,1.1173333333333333,1.1173333333333333]
["Thermal Energy Ice Phase [kWh]:",{"$f":"0.5*$E$27*$E$31*(0-MIN($E$39,0))/3600","v":0},{"$f":"0.5*$E$27*$E$31*(0-MIN($E$39,0))/3600","v":0},0,0,0,0,0,0,0,0,0,0]
["Max Power to cool down the product [kW]: ",{"$f":"B11/$E$32","v":3.6662500000000001E-2},{"$f":"C11/$E$32","v":3.6662500000000001E-2},3.6662500000000001E-2,3.6662500000000001E-2,3.6662500000000001E-2,3.6662500000000001E-2,3.6662500000000001E-2,3.6662500000000001E-2,3.6662500000000001E-2,3.6662500000000001E-2,3.6662500000000001E-2,3.6662500000000001E-2]
["Daily Energy to cool down the product [kWh]: ",{"$f":"IF($E$39>0,B7,B7+B8+B9)*$E$33/30","v":0.29330000000000001},{"$f":"IF($E$39>0,C7,C7+C8+C9)*$E$33/30","v":0.29330000000000001},0.29330000000000001,0.29330000000000001,0.29330000000000001,0.29330000000000001,0.29330000000000001,0.29330000000000001,0.29330000000000001,0.29330000000000001,0.29330000000000001,0.29330000000000001]
["Qtotal for each day [kW]:",{"$f":"B6+B11","v":0.55790000000000006},{"$f":"C6+C11","v":0.57050000000000001},0.57050000000000001,0.57050000000000001,0.55790000000000006,0.53269999999999995,0.52010000000000001,0.53269999999999995,0.54530000000000001,0.55790000000000006,0.55790000000000006,0.55790000000000006]
["COP without battery:",{"$f":"$E$43*(1/((B4+5+273.15)/((MIN(-5,$E$42))+273.15)-1))","v":1.9153571428571432},{"$f":"$E$43*(1/((C4+5+273.15)/((MIN(-5,$E$42))+273.15)-1))","v":1.8621527777777764},1.8621527777777764,1.8621527777777764,1.9153571428571432,2.0314393939393947,2.0949218749999989,2.0314393939393947,1.9716911764705869,1.9153571428571432,1.9153571428571432,1.9153571428571432]
["COP with battery:",{"$f":"$E$43*(1/((B4+5+273.15)/($E$42+273.15)-1))","v":2.19475806451613},{"$f":"$E$43*(1/((C4+5+273.15)/($E$42+273.15)-1))","v":2.1261718749999998},2.1261718749999998,2.1261718749999998,2.19475806451613,2.3461206896551712,2.4299107142857146,2.3461206896551712,2.2679166666666641,2.19475806451613,2.19475806451613,2.19475806451613]
["Energy needed without battery [kWhel]:",{"$f":"B12/B13","v":0.29127727018459815},{"$f":"C12/C13","v":0.30636584001491723},0.30636584001491723,0.30636584001491723,0.29127727018459815,0.26222785754242017,0.24826701473056137,0.26222785754242017,0.27656460936043281,0.29127727018459815,0.29127727018459815,0.29127727018459815,null,"Maximum values "]
["Engergy needed with battery [kWhel]:",{"$f":"B12/B14","v":0.25419658276685642},{"$f":"C12/C14","v":0.26832261620429915},0.26832261620429915,0.26832261620429915,0.25419658276685642,0.22705566783024078,0.21404078633106741,0.22705566783024078,0.24044093330883731,0.25419658276685642,0.25419658276685642,0.25419658276685642,null,null,"rounded"]
["Cooling units needed (no battery):",{"$f":"1000*B15/(70*8)","v":0.52013798247249665},{"$f":"1000*C16/(70*8)","v":0.47914752893624851},0.47914752893624851,0.47914752893624851,0.45392246922652929,0.40545654969685857,0.38221568987690607,0.40545654969685857,0.42935880948006666,0.45392246922652929,0.45392246922652929,0.45392246922652929,null,{"$f":"MAX(B17:M17)","v":0.52013798247249665},{"$f":"MAX(1,IF( O17-ROUNDDOWN(O17,0)<0.2,  ROUNDDOWN(O17,0),      ROUNDUP(O17,0)        ))","v":1}]
["PV without battery (Wp):",{"$f":"(1+$E$59/100)*1.7*1000*B15/B5","v":103.82625275934869},{"$f":"(1+$E$59/100)*1.7*1000*C15/C5","v":102.58613733832836},112.84475107216117,127.74877479867304,139.93973197999173,134.77292213226713,124.69775058057742,123.30288620611672,109.14424762259938,109.10555374711218,114.95049412642177,110.98668398413136,null,{"$f":"MAX(B18:M18)","v":139.93973197999173},{"$f":"ROUND(O18,0)","v":140}]
["Cooling units needed (with battery):",{"$f":"1000*B16/(70*24)","v":0.15130748974217642},{"$f":"1000*C16/(70*24)","v":0.15971584297874949},0.15971584297874949,0.15971584297874949,0.15130748974217642,0.1351521832322862,0.12740522995896869,0.1351521832322862,0.1431196031600222,0.15130748974217642,0.15130748974217642,0.15130748974217642,null,0.15971584297874949,{"$f":"MAX(1,IF( O19-ROUNDDOWN(O19,0)<0.2,  ROUNDDOWN(O19,0),      ROUNDUP(O19,0)        ))","v":1}]
["PV with battery (Wp):",{"$f":"(1+$E$59/100)*1000*B16/B5","v":53.299283483373124},{"$f":"(1+$E$59/100)*1000*C16/C5","v":52.851424403877104},58.136566844264813,65.814981333129978,71.838164694981174,68.644736785886749,63.239323234178997,62.802631527513405,55.816645232408668,56.009416541849717,59.009920999448816,56.975096137398857,null,71.838164694981174,72]
["Battery (Ah related to 12 V):",{"$f":"MAX($E$58,1)*(1+$E$59/100)*1000*B16/12","v":27.537963133076115},{"$f":"MAX($E$58,1)*(1+$E$59/100)*1000*C16/12","v":29.068283422132406},29.068283422132406,29.068283422132406,27.537963133076115,24.597697348276085,23.187751852532301,24.597697348276085,26.047767775124044,27.537963133076115,27.537963133076115,27.537963133076115,null,29.068283422132406,29]
[]
[]
[]
["Product information"]
[]
[{"$f":"'2 Input'!B16","v":"Total mass to be cooled"},null,null,"Mass =",{"$f":"'Systems Table'!N18","v":12},"kg or l"]
[{"$f":"'2 Input'!B17","v":" Moisture content of the product"},null,null,"MC =",{"$f":"'Systems Table'!N19","v":100},"%"]
[{"$f":"'2 Input'!B18","v":" or Heat capacity of the product"},null,null,"cp =",{"$f":"'Systems Table'!N20","v":0},"kJ/kg K"]
["Calculated heat capacity of the product:",null,null,"cp =",{"$f":"4.19-2.3*((100-E28)/100)-0.628*((100-E28)/100)^3","v":4.1900000000000004},"kJ/kg K"]
["CP due to input of the user (either calculated via MC or direct)",null,null,"cp =",{"$f":"IF(E29>0,E29,E30)","v":4.1900000000000004},"kJ/kg K"]
[{"$f":"'2 Input'!B25","v":"Time to cool down the product"},null,null,"t =",{"$f":"'Systems Table'!N27","v":8},"h"]
[{"$f":"'2 Input'!B26","v":"How often do you cool down the product"},null,null,null,{"$f":"'Systems Table'!N28","v":30}]
[]
[]
["Temperature information"]
[]
[{"$f":"'2 Input'!B23","v":"Initial temperature of the product"},null,null,"Ti =",{"$f":"'Systems Table'!N25","v":25},"°C"]
[{"$f":"'2 Input'!B24","v":"Final temperature of the product"},null,null,"Tm =",{"$f":"'Systems Table'!N26","v":4},"°C"]
[]
{"$rows_left_out":90}
{"sheet":"Systems Table","index":5,"n_rows":59,"n_cols":14,"rows_kept":59,"cut":false,"hidden":true,"merged":[]}
[]
[null,null,null,"System","Number",null,null,"Batteries",null,null,"Changing pictures:"]
["Possible Systems to choose:",null,null,"Smart ice-maker",1,null,null,"Yes",null,null,null,{"$f":"D3","v":"Smart ice-maker"},{"$f":"IF($E$9=E3,1,0)","v":0}]
[null,null,null,"Battery-free refrigerator",2,null,null,"No",null,null,null,{"$f":"D4","v":"Battery-free refrigerator"},{"$f":"IF($E$9=E4,1,0)","v":1}]
[null,null,null,"Water chiller for milk cooling",3,{"$nulls":6},"Water chiller for milk cooling",{"$f":"IF($E$9=E5,1,0)","v":0}]
[null,null,null,"Water chiller for cold rooms",4,{"$nulls":6},"Water chiller for cold rooms",{"$f":"IF($E$9=E6,1,0)","v":0}]
[null,null,null,"Own system design",5,{"$nulls":6},"Own system design",{"$f":"IF($E$9=E7,1,0)","v":0}]
[]
["Selected value:",null,null,{"$f":"'2 Input'!E11","v":"Battery-free refrigerator"},{"$f":"VLOOKUP(D9,D3:E7,2,FALSE)","v":2}]
[]
[]
[]
[null,null,null,"System Data",null,null,{"$f":"D3","v":"Smart ice-maker"},{"$f":"D4","v":"Battery-free refrigerator"},{"$f":"D5","v":"Water chiller for milk cooling"},{"$f":"D6","v":"Water chiller for cold rooms"},{"$f":"D7","v":"Own system design"},null,null,"Selected values depending on user choice (are used for Calculation sheet)"]
[null,null,1,"Number",null,null,{"$f":"E3","v":1},{"$f":"E4","v":2},{"$f":"E5","v":3},{"$f":"E6","v":4},{"$f":"E7","v":5}]
[null,null,2]
[null,null,3,"Product information"]
[null,null,4]
[null,null,5,{"$f":"'2 Input'!B16","v":"Total mass to be cooled"},null,"Mass =",20,12,70,1000,{"$f":"'2 Input'!K16","v":10},"kg or l",null,{"$f":"HLOOKUP($E$9,$G$14:$K$59,C18)","v":12}]
[null,null,6,{"$f":"'2 Input'!B17","v":" Moisture content of the product"},null,"MC =",100,100,99,86,{"$f":"'2 Input'!K17","v":100},"% wet based",null,{"$f":"HLOOKUP($E$9,$G$14:$K$59,C19)","v":100}]
[null,null,7,{"$f":"'2 Input'!B18","v":" or Heat capacity of the product"},null,"cp = ",{"$nulls":4},{"$f":"'2 Input'!K18","v":0},"kJ/kg K",null,0]
[null,null,8]
[null,null,9]
[null,null,10,"Temperature information"]
[null,null,11]
[null,null,12,{"$f":"'2 Input'!B23","v":"Initial temperature of the product"},null,"Ti =",20,25,35,25,{"$f":"'2 Input'!K23","v":25},"°C",null,25]
[null,null,13,{"$f":"'2 Input'!B24","v":"Final temperature of the product"},null,"Tm =",-10,4,4,12,{"$f":"'2 Input'!K24","v":4},"°C",null,4]
[null,null,14,{"$f":"'2 Input'!B25","v":"Time to cool down the product"},null,"t =",24,8,4,24,{"$f":"'2 Input'!K25","v":10},"h",null,8]
[null,null,15,{"$f":"'2 Input'!B26","v":"How often do you cool down the product"},null,null,30,30,30,1,{"$f":"'2 Input'!K26","v":30},"per month",null,30]
[null,null,16]
[null,null,17]
[null,null,18,"System information"]
[null,null,19,null,null,null,"Yes","No","Yes","Yes",{"$f":"'2 Input'!K31","v":"Yes"},null,null,"No"]
[null,null,20,{"$f":"'2 Input'!B32","v":"Autonomy of the system"},null,null,1,1,1,1,{"$f":"'2 Input'!K32","v":1},"days",null,1]
[null,null,21,{"$f":"'2 Input'!B33","v":"System losses"},null,null,25,30,25,25,{"$f":"'2 Input'!K33","v":25},"%",null,30]
[null,null,22]
[null,null,23,"Isolation material"]
[null,null,24]
[null,null,25,{"$f":"'2 Input'!B37","v":"Area of the cooling room"},null,"A =",2.12,0.9,5,24,{"$f":"'2 Input'!K37","v":2},"m²",null,0.9]
[null,null,26,{"$f":"'2 Input'!B38","v":"Thermal conductivity of insulation"},null,"k /  l =",3.5000000000000003E-2,3.5000000000000003E-2,3.5000000000000003E-2,3.5000000000000003E-2,{"$f":"'2 Input'!K38","v":3.5000000000000003E-2},"W/m K",null,3.5000000000000003E-2]
[null,null,27,{"$f":"'2 Input'!B39","v":"Thickness of insulation"},null,"L =",0.1,0.06,0.1,0.1,{"$f":"'2 Input'!K39","v":0.1},"m",null,0.06]
{"$rows_left_out":19}