{"text_format":"2","workbook":"xlsx","n_sheets":3,"sheets":["Table rentabilité","Remboursement Mensualités","investissement réel"],"not_rendered":{"charts":0,"images":1,"macros":0,"external_links":0,"defined_names":0,"comments":0,"pivot_tables":0},"unopened":[],"bounds":{"document_bytes":16777216,"sheet_cells":100000,"run_cost":"one","rows_first":2000,"rows_last":500,"rows_between":2000,"halvings":0,"cell_chars":16384,"cell_head_chars":4096},"cells_cut":0,"cells_raw":0,"read":"whole","date_system":"1900"}

{"sheet":"Table rentabilité","index":0,"n_rows":196,"n_cols":23,"rows_kept":196,"cut":false,"hidden":false,"merged":[[16,2,17,2],[16,3,16,4],[16,5,17,5],[66,5,66,6],[101,2,101,3],[99,2,99,3],[16,7,17,7],[65,5,65,6],[16,6,17,6],[16,10,17,10],[16,8,16,9],[48,1,49,1],[48,7,49,7],[50,1,51,1],[50,7,51,7],[135,2,135,3],[111,2,111,3],[68,5,68,6],[77,5,77,6],[100,2,100,3],[105,2,105,3],[106,2,106,3],[107,2,107,3],[102,2,102,3],[103,2,103,3],[104,2,104,3],[137,2,137,3],[108,2,108,3],[109,2,109,3],[110,2,110,3],[133,2,133,3],[134,2,134,3],[132,2,132,3],[136,2,136,3]]}
[]
[null,"ETUDE RENTABILITE SOLUTIONS USAGE PRODUCTIF"]
[null,"Menuiserie Métallique"]
[]
[null,"Dimmensionnement réel"]
[null,"Dimmensionnement optimisé "]
[null,"Dimmensionnement réel"]
[]
[]
[null,"Cases à vérifier"]
[null,"Cases à compléter"]
[null,"Cases à laisser vides"]
[null,"Cases calculées"]
[]
[null,"Caractéristiques techniques du Projet"]
[]
[null,"Usage Productif","Rendement (kg/heure)","Puissance (kW)",null,"Prix (FCFA)","Energie consommée (KWh/j)","Energie à produire (kWh/j)","Fonctionnement optimal",null,"Coefficient déperdition (k)"]
[null,null,null,"Projet","Nominale",null,null,null,"heures par jour","jours à l'année"]
[null,"Poste de soudure",null,null,2,250000,{"$f":"E19*I19","v":6},{"$f":"G19/K19","v":7.5},3,365,0.8]
[null,"Meule",null,null,1,40000,{"$f":"E20*I20","v":6},{"$f":"G20/K20","v":7.5},6,null,0.8]
[null,"Perceuse",null,null,1,{"$f":"100000","v":100000},6,{"$f":"G21/K21","v":7.5},6,null,0.8]
[{"$nulls":8},6]
[]
[]
[null,"Equipements facultatifs"]
[null,"designation","nombre","prix"]
[null,"Installation atelier",1,1500000]
[null,"Construction Bureau",1,500000]
[null," Construction magasin de vente de pièces détaillées dans l'atelier ",1,1500000]
[null,"Plat pour moteur",1,160000]
[null,"Etau",1,40000]
[null,"Accessoires",1,2618801]
[]
[]
[null,"Alimentation Solaire","Puissance (kW)","Prix (FCFA)","Coefficient déperdition","Tension (V)",null,"Batteries","Capacité (Ampères/h)","Prix (FCFA)","Tension (V)","Durée de vie*","* en conditions optimales, annoncées constructeur"]
[null,"Panneaux solaires de 375 W",0.375,97987,0.6,"24V",null,"Batteries de 12 V/185 Ah    ",185,433902,12,10]
[null,"BlueSolar SPM-300-24 Monocristallin",0.3,100000,0.6,"24V",null,"Victron Energy Gel 2",265,null,12,10]
[{"$nulls":7},"Tension nécessaire système",{"$f":"IF(J38<0.5,12,IF(AND(J38>=0.5,J38<2),24,IF(J38>=2,48)))","v":48},{"$f":"F84*INDEX(C:C,MATCH(F62,B:B,0))","v":4.125}]
[]
[null,"Onduleur","kVa","Prix (FCFA)",null,null,null,"Régulateur","Courant (A)","Prix (FCFA)","Tension (V)"]
[null,"Onduleur chargeur Victron QUATTRO         ",2,2116221,null,null,null,"BlueSolar 150V 35A de Victron Energy",35,220000,"12V/24V/48V"]
[null,"Victron quatro 5 kW",5,1426500,null,null,null,"Régulateur de charge Smartsolar Victron MPPT 250/100                          ",100,400000,"12V/24V/48V"]
[]
[null,"Irradiation Solaire"]
[null,"Month ","Jan ","Feb ","Mar ","Apr ","May ","Jun ","Jul ","Aug ","Sep ","Oct ","Nov ","Dec ","Year"]
[null,"H(15)*",5.12,5.75,6.37,6.61,6.34,6.05,6.26,5.51,6.03,5.81,5.226,5.03,{"$f":"IF('Table rentabilité'!G72=\"x\",MAX(C46:N46),IF('Table rentabilité'!G73=\"x\",MIN(C46:N46),IF('Table rentabilité'!G74=\"x\",AVERAGE(C46:N46),\"erreur\")))","v":5.8421666666666674}]
[]
[null,"Électricité du réseau",null,"1ère Tranche","2ème Tranche","3ème Tranche",null,null,null,"1ère Tranche","2ème Tranche","3ème Tranche","Total"]
[null,"UP-Petite Puissance","Tranche (KWh)",50,500,"∞",null,"UP-Petite Puissance","Energie par Tranche",{"$f":"(F77*30)-SUM(K49:L49)","v":50},{"$f":"IF((F77*30)>D49,(F77*30)-D49-L49,0)","v":450},{"$f":"IF((F77*30)>E49,(F77*30)-E49,0)","v":40},{"$f":"SUM(J49:L49)","v":540}]
[null,null,"Prix (KWh)",128.85,135.68,147.68,null,null,"Coût (FCFA)",{"$f":"J49*D50","v":6442.5},{"$f":"K49*E50","v":61056},{"$f":"L49*F50","v":5907.2000000000007},{"$f":"SUM(J50:L50)","v":73405.7}]
[null,"UP-Moyenne Puissance","Tranche",100,500,"∞",null,"UP-Moyenne Puissance","Energie par Tranche",{"$f":"(F77*30)-SUM(K51:L51)","v":100},{"$f":"IF((F77*30)>D51,(F77*30)-D51-L51,0)","v":400},{"$f":"IF((F77*30)>E51,(F77*30)-E51,0)","v":40},540]
[null,null,"Prix (KWh)",129.81,136.53,149.24,null,null,"Coût (FCFA)",{"$f":"J51*D52","v":12981},{"$f":"K51*E52","v":54612},5969.6,73562.600000000006]
[]
[null,"Choix de dimensionnement du projet"]
[]
[null,"Production min. equipements (Nb equip/jour)",null,null,null,{"$f":"INDEX(C:C,MATCH($F$61,B:B,0))*INDEX(I:I,MATCH($F$61,B:B,0))","v":0}]
[null,"Temps de fonctionnement (heures/jour)",null,null,null,9]
[]
[null,"Choix du poste",null,null,null,"Poste de soudure"]
[null,"Choix du meule",null,null,null,"Meule"]
[null,"Choix de la perceuse",null,null,null,"Perceuse"]
[null,"Choix de l'alimentation solaire",null,null,null,"Panneaux solaires de 375 W"]
[null,"Choix du système de stokage",null,null,null,"Batteries de 12 V/185 Ah    "]
[null,"Choix de l'onduleur",null,null,null,"Onduleur chargeur Victron QUATTRO                           "]
[null,"Choix du régulateur",null,null,null,"Régulateur de charge Smartsolar Victron MPPT 250/100         "]
[null,"Choix décortiqueuse solaire"]
[null,"Equivalent Réseau",null,null,null,{"$f":"IF(M50<M52,B49,B51)","v":"UP-Petite Puissance"}]
[]
[null,"Autonomie nécessaires au projet (jours)",null,null,null,1]
[null,"Profondeur décharge batteries",null,null,null,0.8]
[]
[null,"Choix du cas pour dimensionnement solaire",null,null,null,"best case"]
[{"$nulls":5},"worst case"]
[{"$nulls":5},"average","x"]
[]
[null,"puissance equipement total majoré",null,null,null,{"$f":"SUM(E19:E21)*1.2","v":4.8}]
[null,"Energie journalière consommée (KWh)",null,null,null,{"$f":"G19+G20+G21+G22","v":18},"KWh"]
[null,"Puissance crête projet (KW)",null,null,null,{"$f":"(INDEX(H:H,MATCH(F61,B:B,0))+INDEX(H:H,MATCH(F61,B:B,0))+INDEX(H:H,MATCH(F61,B:B,0)))/O46","v":3.8513108721079505}]
[null,"Capacité totale système stockage (Ampères/heure)",null,null,null,{"$f":"(((G19+G20+G21)*1000)*(F69))/(F70*I38)","v":468.74999999999994}]
[]
[null,"Nombre de poste ",null,null,null,1,"unités"]
[null,"Nombre de meule",null,null,null,1]
[null,"Nombre de perceuse",null,null,null,1,"unités"]
[null,"Nb de panneaux solaires",null,null,null,{"$f":"ROUNDUP(F78/INDEX(C:C,MATCH(F62,B:B,0)),0)","v":11},"unités"]
[null,"Nb de batteries en série",null,null,null,{"$f":"ROUNDUP(I38/INDEX(K:K,MATCH(F63,H:H,0)),0)","v":4},"unités"]
[null,"Nb de batteries en dérivation",null,null,null,{"$f":"ROUNDUP(F79/INDEX(I:I,MATCH(F63,H:H,0)),0)","v":3},"unités"]
[null,"Nb de batteries total",null,null,null,{"$f":"F85*F86","v":12},"unités"]
[null,"Durée de vie attendue de la batterie",null,null,null,{"$f":"INDEX(L:L,MATCH(F63,H:H,0))*(130%-F70)","v":5},"ans"]
[null,"Nb régulateurs",null,null,null,{"$f":"IF(OR(I38=24,I38=12),1,2)","v":2},"unités"]
[null,"Nb onduleurs",null,null,null,1,"unités"]
[]
[null,"Ratio de fonctionnement ",null,null,null,0.9]
[null,"Employés nécessaires pour fonctionnement",null,null,null,10,"personnes"]
[]
[]
[]
[null,"Calcul de charges variables et fixes"]
[]
[null,"RECETTES D'EXPLOITATION"]
[null,"Désignation","Quantité annuelle",null,"Prix unitaire","Montant total/an","Montant total/mois",null,"évolution annuelle charges d'exploitation",null,null,0.01]
[null,"Entretien charrue",{"$f":"30","v":30},null,{"$f":"20000","v":20000},{"$f":"E101*C101","v":600000},{"$f":"F101/12","v":50000},{"$nulls":4},0]
[null,"Révision moteur",{"$f":"12","v":12},null,{"$f":"150000","v":150000},{"$f":"E102*C102","v":1800000},{"$f":"F102/12","v":150000}]
[null,"Entretien système hydraulique",{"$f":"10","v":10},null,{"$f":"60000","v":60000},600000,50000]
[null,"Vente de pièces détachées ",{"$f":"12","v":12},null,{"$f":"400000","v":400000},4800000,400000]
[null,"Autres réparations",{"$f":"12","v":12},null,{"$f":"300000","v":300000},3600000,300000]
[null,"Soudure entretien charrue",{"$f":"C101","v":30},null,{"$f":"10000","v":10000},300000,25000]
[null,"Soudure révision moteur",{"$f":"C102","v":12},null,{"$f":"10000","v":10000},120000,10000]
[null,"Soudure entretien système hydraulique",{"$f":"C103","v":10},null,{"$f":"10000","v":10000},100000,8333.3333333333339]
[null,"Soudure  autres réparations",{"$f":"C105","v":12},null,{"$f":"10000","v":10000},120000,10000]
[null,"Ventes machines",null,null,null,{"$f":"E110*C110","v":0},0,null,"Avantage coût électricité PV vs. Réseau",null,"Sur 1 an",{"$f":"(MIN(M50,M52)*12)-SUM(G124:G127)","v":100629.99999999988}]
[{"$nulls":5},0,0]
[null," TOTAL (F CFA) ",null,null,null,{"$f":"SUM(F101:F111)","v":12040000},{"$f":"SUM(G101:G111)","v":1003333.3333333334},null,null,null,"Sur 5 ans",{"$f":"(MIN(M50,M52)*12*5)-(SUM(G124:G127)*5)","v":503150}]
[{"$nulls":10},"Sur 9 ans",{"$f":"(MIN(M50,M52)*12*9)-(SUM(G124:G127)*9)","v":905669.99999999907}]
[null,"INVESTISSEMENTS"]
[null,"Désignation ","Quantité","Prix unitaire TTC","Durée de vie (an)","Montant Total TTC","Amortissement annuel"]
[null,"Installation atelier",{"$f":"IF($B$5=INDEX($B$6:$B$7,1,1),C27,'investissement réel'!C4)","v":1},{"$f":"IF($B$5=INDEX($B$6:$B$7,1,1),D27,'investissement réel'!D4)","v":1500000},20,{"$f":"C116*D116","v":1500000},{"$f":"IFERROR(F116/E116,0)","v":75000}]
[null,"Construction Bureau",{"$f":"IF($B$5=INDEX($B$6:$B$7,1,1),C28,'investissement réel'!C5)","v":1},{"$f":"IF($B$5=INDEX($B$6:$B$7,1,1),D28,'investissement réel'!D5)","v":500000},20,{"$f":"C117*D117","v":500000},25000]
[null,"Construction magasin de vente de pièces détaillées dans l'atelier ",{"$f":"IF($B$5=INDEX($B$6:$B$7,1,1),C29,'investissement réel'!C6)","v":1},{"$f":"IF($B$5=INDEX($B$6:$B$7,1,1),D29,'investissement réel'!D6)","v":1500000},20,{"$f":"C118*D118","v":1500000},{"$f":"IFERROR(F118/E118,0)","v":75000}]
[null,"Plat pour moteur",{"$f":"IF($B$5=INDEX($B$6:$B$7,1,1),C30,'investissement réel'!C7)","v":1},{"$f":"IF($B$5=INDEX($B$6:$B$7,1,1),D30,'investissement réel'!D7)","v":160000},15,{"$f":"C119*D119","v":160000},{"$f":"IFERROR(F119/E119,0)","v":10666.666666666666}]
[null,"Etau",{"$f":"IF($B$5=INDEX($B$6:$B$7,1,1),C31,'investissement réel'!C8)","v":1},{"$f":"IF($B$5=INDEX($B$6:$B$7,1,1),D31,'investissement réel'!D8)","v":40000},10,{"$f":"C120*D120","v":40000},{"$f":"IFERROR(F120/E120,0)","v":4000}]
{"$rows_left_out":70}
{"sheet":"Remboursement Mensualités","index":1,"n_rows":133,"n_cols":7,"rows_kept":133,"cut":false,"hidden":true,"merged":[]}
["Remboursement de prêt"]
["Taux annuel",{"$f":"'Table rentabilité'!D167","v":0.12}]
["Capital emprunté",{"$f":"'Table rentabilité'!D166","v":8036474}]
["Durée du prêt (en année)",{"$f":"'Table rentabilité'!D168","v":4},{"$f":"B4*12","v":48}]
["Mensualité à régler",{"$f":"-PMT((1+B2)^(1/12)-1,B4*12,B3)","v":209218.710701537},"Formule mensualité","=-VPM((1+B2)^(1/12)-1;B4*12;B3)"]
[]
["Décomposition de la mensualité"]
["Remboursement du principal",{"$f":"-PPMT((1+B2)^(1/12)-1,1,B4*12,B3)","v":132962.27299137664},"Formule principal","=-PRINCPER((1+B2)^(1/12)-1;1;B4*12;B3)"]
["Remboursement des interêts",{"$f":"-IPMT((1+B2)^(1/12)-1,1,B4*12,B3)","v":76256.437710160346},"Formule intérêt","=-INTPER((1+B2)^(1/12)-1;1;B4*12;B3)"]
[]
[]
["Dans les formules ci-dessous Taux de période = TP =  (1+$B$2)^(1/12)-1"]
["Périodes","Mensualité","Capital","Intérêts","Reste (ou résiduel)","Années"]
[{"$f":"IF(B4<>0,1,\"-\")","v":1},{"$f":"IF(A14<>\"-\",C14+D14,\"\")","v":209218.71070153697},{"$f":"IF(A14<>\"-\",-PPMT((1+$B$2)^(1/12)-1,A14,$B$4*12,$B$3),\"\")","v":132962.27299137664},{"$f":"IF(A14<>\"-\",-IPMT((1+$B$2)^(1/12)-1,A14,$B$4*12,$B$3),\"\")","v":76256.437710160346},{"$f":"IF(A14<>\"-\",$B$3+CUMPRINC((1+$B$2)^(1/12)-1,$B$4*12,$B$3,1,A14,0),\"\")","v":7903511.7270086231},{"$f":"IF(A14<>\"-\",1,\"\")","v":1},{"$f":"IF(A14<>\"-\",1,\"\")","v":1}]
[{"$f":"IF(AND($B$4<>0,A14<$C$4),A14+1,\"-\")","v":2},{"$f":"IF(A15<>\"-\",C15+D15,\"\")","v":209218.710701537},{"$f":"IF(A15<>\"-\",-PPMT((1+$B$2)^(1/12)-1,A15,$B$4*12,$B$3),\"\")","v":134223.92446790333},{"$f":"IF(A15<>\"-\",-IPMT((1+$B$2)^(1/12)-1,A15,$B$4*12,$B$3),\"\")","v":74994.786233633669},{"$f":"IF(A15<>\"-\",$B$3+CUMPRINC((1+$B$2)^(1/12)-1,$B$4*12,$B$3,1,A15,0),\"\")","v":7769287.8025407195},{"$f":"IF(A15<>\"-\",IF(G14<G15,F14,F14+1),\"\")","v":1},{"$f":"IF(A15=\"-\",\"\",IF(G14<12,G14+1,1))","v":2}]
[{"$f":"IF(AND($B$4<>0,A15<$C$4),A15+1,\"-\")","v":3},209218.71070153703,135497.54749404639,73721.163207490623,7633790.2550466741,{"$f":"IF(A16<>\"-\",IF(G15<G16,F15,F15+1),\"\")","v":1},{"$f":"IF(A16=\"-\",\"\",IF(G15<12,G15+1,1))","v":3}]
[4,209218.71070153697,136783.25566536121,72435.455036175772,7497006.9993813122,1,4]
[5,209218.71070153697,138081.16365528796,71137.547046249019,7358925.8357260246,1,5]
[6,209218.710701537,139391.38722537927,69827.323476157733,7219534.4485006453,1,6]
[7,209218.71070153697,140714.04323562517,68504.667465911814,7078820.4052650202,1,7]
[8,209218.71070153703,142049.24965487601,67169.461046661017,6936771.1556101441,1,8]
[9,209218.71070153697,143397.12557136398,65821.585130173,6793374.0300387796,1,9]
[10,209218.71070153703,144757.79120332509,64460.919498211922,6648616.238835454,1,10]
[11,209218.71070153697,146131.36790972101,63087.342791815958,6502484.8709257338,1,11]
[12,209218.710701537,147517.97820106376,61700.732500473248,6354966.8927246695,1,12]
[13,209218.710701537,148917.74575034197,60300.964951195019,6206049.146974328,2,1]
[14,209218.71070153697,150330.79540405184,58887.915297485139,6055718.3515702765,2,2]
[15,209218.710701537,151757.25319333209,57461.45750820492,5903961.0983769437,2,3]
[16,209218.71070153703,153197.24634520471,56021.464356332304,5750763.8520317394,2,4]
[17,209218.710701537,154650.90329392266,54567.807407614346,5596112.9487378169,2,5]
[18,209218.71070153703,156118.35369242492,53100.357009112093,5439994.5950453915,2,6]
[19,209218.710701537,157599.72842390032,51618.982277636671,5282394.8666214924,2,7]
[20,209218.71070153697,159095.15961346123,50123.55108807575,5123299.7070080303,2,8]
[21,209218.71070153697,160604.78063992781,48613.930061609179,4962694.9263681024,2,9]
[22,209218.710701537,162128.72614772423,47089.984553812777,4800566.2002203781,2,10]
[23,209218.71070153703,163667.13205888771,45551.5786426493,4636899.0681614904,2,11]
[24,209218.71070153703,165220.13558519157,43998.575116345448,4471678.9325762987,2,12]
[25,209218.71070153697,166787.87524038315,42430.835461153831,4304891.057335916,3,1]
[26,209218.71070153697,168370.49085253821,40848.219848998771,4136520.5664833775,3,2]
[27,209218.71070153697,169968.12357653206,39250.587125004924,3966552.4429068444,3,3]
[28,209218.710701537,171580.91590662941,37637.794794907597,3794971.5270002158,3,4]
[29,209218.710701537,173209.01168919352,36009.699012343473,3621762.5153110223,3,5]
[30,209218.710701537,174852.55613551606,34366.154566020945,3446909.9591755057,3,6]
[31,209218.710701537,176511.69583476853,32707.014866768477,3270398.2633407367,3,7]
[32,209218.710701537,178186.57876707675,31032.131934460249,3092211.6845736597,3,8]
[33,209218.71070153703,179877.35431671934,29341.356384817689,2912334.3302569417,3,9]
[34,209218.71070153703,181584.17328545131,27634.537416085714,2730750.1569714909,3,10]
[35,209218.71070153703,183307.1879059544,25911.522795582612,2547442.9690655349,3,11]
[36,209218.710701537,185046.5518554147,24172.158846122311,2362396.4172101207,3,12]
[37,209218.710701537,186802.4202692293,22416.290432307698,2175593.9969408913,4,1]
[38,209218.710701537,188574.94975484296,20643.760946694023,1987019.0471860506,4,2]
[39,209218.71070153703,190364.29840571611,18854.412295820915,1796654.7487803334,4,3]
[40,209218.710701537,192170.6258154251,17048.084886111898,1604484.1229649074,4,4]
[41,209218.710701537,193994.09309189691,15224.617609640089,1410490.0298730098,4,5]
[42,209218.710701537,195834.86287177814,13383.847829758848,1214655.1670012334,4,6]
[43,209218.710701537,197693.09933494093,11525.611366596082,1016962.0676662903,4,7]
[44,209218.71070153697,199568.96821912611,9649.7424824108712,817393.09944716748,4,8]
[45,209218.710701537,201462.6368347258,7756.0738668111971,615930.46261243988,4,9]
[46,209218.710701537,203374.27407970562,5844.4366218313808,412556.18853273429,4,10]
[47,209218.71070153703,205304.05045466911,3914.6602468679152,207252.13807806466,4,11]
[48,209218.710701537,207252.13807806463,1966.5726234723695,0,4,12]
["-","","","","","",""]
["-","","","","","",""]
["-","","","","","",""]
["-","","","","","",""]
["-","","","","","",""]
["-","","","","","",""]
["-","","","","","",""]
["-","","","","","",""]
["-","","","","","",""]
["-","","","","","",""]
["-","","","","","",""]
["-","","","","","",""]
["-","","","","","",""]
["-","","","","","",""]
["-","","","","","",""]
["-","","","","","",""]
["-","","","","","",""]
["-",{"$f":"IF(A79<>\"-\",C79+D79,\"\")","v":""},{"$f":"IF(A79<>\"-\",-PPMT((1+$B$2)^(1/12)-1,A79,$B$4*12,$B$3),\"\")","v":""},{"$f":"IF(A79<>\"-\",-IPMT((1+$B$2)^(1/12)-1,A79,$B$4*12,$B$3),\"\")","v":""},{"$f":"IF(A79<>\"-\",$B$3+CUMPRINC((1+$B$2)^(1/12)-1,$B$4*12,$B$3,1,A79,0),\"\")","v":""},"",""]
[{"$f":"IF(AND($B$4<>0,A79<$C$4),A79+1,\"-\")","v":"-"},"","","","",{"$f":"IF(A80<>\"-\",IF(G79<G80,F79,F79+1),\"\")","v":""},{"$f":"IF(A80=\"-\",\"\",IF(G79<12,G79+1,1))","v":""}]
["-","","","","","",""]
["-","","","","","",""]
["-","","","","","",""]
["-","","","","","",""]
["-","","","","","",""]
["-","","","","","",""]
["-","","","","","",""]
["-","","","","","",""]
["-","","","","","",""]
["-","","","","","",""]
["-","","","","","",""]
["-","","","","","",""]
["-","","","","","",""]
["-","","","","","",""]
["-","","","","","",""]
["-","","","","","",""]
["-","","","","","",""]
["-","","","","","",""]
["-","","","","","",""]
["-","","","","","",""]
["-","","","","","",""]
["-","","","","","",""]
["-","","","","","",""]
["-","","","","","",""]
["-","","","","","",""]
["-","","","","","",""]
["-","","","","","",""]
["-","","","","","",""]
["-","","","","","",""]
["-","","","","","",""]
["-","","","","","",""]
["-","","","","","",""]
["-","","","","","",""]
["-","","","","","",""]
["-","","","","","",""]
["-","","","","","",""]
["-","","","","","",""]
["-","","","","","",""]
["-","","","","","",""]
["-","","","","","",""]
{"$rows_left_out":14}
{"sheet":"investissement réel","index":2,"n_rows":23,"n_cols":7,"rows_kept":23,"cut":false,"hidden":false,"merged":[]}
[]
[]
[null,"Désignation ","Quantité","Prix unitaire TTC","Montant Total TTC","Durée de vie (an)","Amortissement annuel"]
[null,"Installation atelier",1,1500000,{"$f":"C4*D4","v":1500000},20,{"$f":"E4/F4","v":75000}]
[null,"Construction Bureau",1,500000,500000,20,25000]
[null," Construction magasin de vente de pièces détaillées dans l'atelier ",1,1500000,1500000,20,75000]
[null,"Plat pour moteur",1,160000,160000,15,10666.666666666666]
[null,"Etau",1,40000,{"$f":"C8*D8","v":40000},10,{"$f":"E8/F8","v":4000}]
[null,"Poste de soudure",1,250000,250000,10,25000]
[null,"Meule",1,40000,40000,10,4000]
[null,"Perceuse",1,{"$f":"100000","v":100000},{"$f":"C11*D11","v":100000},10,{"$f":"E11/F11","v":10000}]
[null,"Panneaux",1,{"$f":"97987*12","v":1175844},{"$f":"C12*D12","v":1175844},{"$f":"20","v":20},58792.2]
[null,"Batteries",1,{"$f":"433902*4","v":1735608},{"$f":"C13*D13","v":1735608},7,247944]
[null,"Onduleur",1,{"$f":"2116221","v":2116221},2116221,10,211622.1]
[null,"Accessoires",1,{"$f":"7646474-(D12+D13+D14)","v":2618801},2618801,10,261880.1]
[{"$nulls":4},{"$f":"C16*D16","v":0}]
[{"$nulls":4},0]
[{"$nulls":4},0]
[{"$nulls":4},0]
[{"$nulls":4},0]
[{"$nulls":4},{"$f":"C21*D21","v":0}]
[{"$nulls":4},0]
[null," TOTAL (F CFA) ",null,null,{"$f":"SUM(E4:E22)","v":11736474},null,{"$f":"SUM(G4:G22)","v":1008905.0666666667}]