{"text_format":"1","workbook":"xlsx","n_sheets":8,"sheets":["READ ME","1 INPUT","2 OUTPUT","Translate","Cashflow Calculation","Loan Repayment Solar","Loan Repayment Grid","Loan Repayment Diesel"],"not_rendered":{"charts":8,"images":6,"macros":1,"external_links":0,"defined_names":200,"comments":0,"pivot_tables":0},"unopened":[],"bounds":{"document_bytes":16777216,"sheet_cells":100000,"rows_first":2000,"rows_last":500,"rows_between":2000,"halvings":0,"cell_chars":16384,"cell_head_chars":4096},"cells_cut":0,"cells_raw":0,"read":"whole","date_system":"1900"}

{"sheet":"READ ME","index":0,"n_rows":102,"n_cols":7,"rows_kept":102,"cut":false,"hidden":false,"merged":[[57,3,76,9],[20,3,25,9],[47,5,47,9],[55,5,55,9],[12,3,12,9],[43,6,44,9],[48,3,49,4],[48,5,49,9],[37,3,37,9],[27,3,27,9],[93,3,99,9],[101,3,101,5],[40,6,42,9],[40,3,42,5],[51,3,51,4],[51,5,51,9],[52,3,54,4],[52,5,53,9],[54,5,54,7],[55,3,55,4],[43,3,44,5],[78,3,91,9],[50,3,50,4],[50,5,50,7],[46,3,46,9],[47,3,47,4],[10,3,10,5],[33,3,33,9],[34,3,34,9],[35,3,35,9],[38,3,38,9],[28,3,28,9],[29,3,29,9],[30,3,30,9],[31,3,31,9],[32,3,32,9],[17,3,17,9],[19,3,19,9],[10,6,10,8]]}
[]
[]
[]
[]
[]
[]
[]
[]
[]
[]
[null,null,null,{"$f":"Translate!$C$14","v":"Selected Language:"},null,null,"English"]
[]
[null,null,null,{"$f":"Translate!$C$7","v":"READ ME"}]
[]
[]
[]
[]
[null,null,null,{"$f":"Translate!$C$19","v":"INVEST – Payback Tool"}]
[]
[null,null,null,{"$f":"Translate!$C$20","v":"Introduction"}]
{"$rows_left_out":83}
{"sheet":"1 INPUT","index":1,"n_rows":119,"n_cols":11,"rows_kept":119,"cut":false,"hidden":false,"merged":[[59,1,59,2],[91,1,91,2],[63,1,71,1],[76,1,78,1],[84,1,87,1],[21,5,22,5],[32,6,32,9],[52,1,55,1],[33,1,42,1],[42,6,42,7],[43,6,44,8],[40,6,40,9],[23,6,24,10],[21,6,22,10],[55,4,55,5],[63,8,63,10],[11,1,11,3],[13,1,13,3],[15,1,15,3],[17,1,17,3],[59,3,59,7],[29,3,29,7],[21,1,21,3],[23,5,24,5],[25,5,25,10],[19,1,20,3],[29,1,29,2],[46,1,47,1],[61,8,61,10],[23,1,23,3],[25,1,25,3],[2,1,2,10],[19,6,20,10],[0,1,0,8],[9,5,10,10],[5,1,5,10],[7,1,7,3],[9,1,9,3],[7,5,7,10],[13,5,14,10],[19,5,20,5],[17,5,18,10],[15,5,16,10],[11,5,12,10],[64,8,64,10],[66,8,66,10],[61,6,62,7],[118,4,118,5],[87,4,87,5],[67,8,68,10],[99,9,101,10],[91,3,91,7],[75,6,75,10],[85,6,85,8],[95,8,95,10],[114,6,114,8],[79,6,79,8],[78,6,78,8],[77,6,77,8],[69,6,69,8],[107,1,109,1],[115,1,118,1],[100,6,101,7],[93,6,94,7],[103,6,103,8],[104,6,105,8],[93,8,93,10],[99,8,101,8],[107,6,107,10],[109,6,109,8],[110,6,110,8],[111,6,111,8],[95,1,102,1],[116,6,116,8],[112,6,112,8],[113,6,113,8],[80,6,80,8],[71,6,71,8],[72,6,73,8],[115,6,115,8],[84,6,84,8],[83,6,83,8],[82,6,82,8],[81,6,81,8]]}
[null,{"$f":"Translate!$C$50","v":"INVEST – Payback Tool"}]
[]
[null,{"$f":"Translate!$C$51","v":"This INPUT sheet requires entry of values, which then serve the results displayed in the next OUTPUT sheet."}]
[null,null," "]
[]
[null,{"$f":"Translate!$C$52","v":"Basic assumptions"}]
[]
[null,{"$f":"Translate!$C$53","v":"Currency used for calculation"},null,null,null,{"$f":"Translate!$C$63","v":"enter any currency"}]
[]
[null,{"$f":"Translate!$C$54","v":"Inflation"},null,null,null,{"$f":"Translate!$C$64","v":"the national percentage rate for the devaluation of money per year (provided by national statistics)"}]
[]
[null,{"$f":"Translate!$C$55","v":"Discount rate"},null,null,null,{"$f":"Translate!$C$65","v":"the annual rate used to determine the present value of future cash flows (Tip: the simplified discount rate is often equal to interest rate earned from bank savings or treasury bonds)"}]
[]
[null,{"$f":"Translate!$C$56","v":"Annual profit margin increase"},null,null,null,{"$f":"Translate!$C$66","v":"the rate at which the farmer will increase prices every year (calculated as per own records)"}]
[]
[null,{"$f":"Translate!$C$57","v":"Annual fuel price increase"},null,null,null,{"$f":"Translate!$C$67","v":"the rate at which the fuel (Diesel, petrol or LPG) will increase every year (as provided by national regulator or from national energy statistics)"}]
[]
[null,{"$f":"Translate!$C$58","v":"Annual electricity price increase"},null,null,null,{"$f":"Translate!$C$68","v":"the rate at which the grid electricity prices will increase every year (provided by national electricity regulator or utility)"}]
[]
[null,{"$f":"Translate!$C$59","v":"Water levy (surcharge for water utilisation rights)"},null,null,null,{"$f":"E8&\" \"&Translate!$C$69","v":" per m³"},{"$f":"Translate!$C$70","v":"the water price per m3 as determined by the government, the local authority for utilising shared water resources with own pumping systems"}]
{"$rows_left_out":100}
{"sheet":"2 OUTPUT","index":2,"n_rows":35,"n_cols":18,"rows_kept":35,"cut":false,"hidden":false,"merged":[[26,16,26,17],[28,16,28,17],[30,16,30,17],[32,16,32,17],[32,4,32,5],[30,10,30,11],[30,4,30,5],[32,10,32,11],[30,13,30,15],[32,13,32,15],[22,10,22,11],[20,10,20,11],[24,10,24,11],[26,10,26,11],[28,10,28,11],[17,1,18,3],[2,1,2,17],[0,1,0,17],[24,1,25,3],[20,4,20,5],[22,4,22,5],[24,4,24,5],[20,16,20,17],[22,16,22,17],[24,16,24,17],[20,13,20,15],[19,7,19,11],[19,13,19,17],[19,1,19,5],[6,7,8,14],[9,7,11,14],[23,7,23,9],[25,7,25,9],[27,7,27,9],[29,7,29,9],[31,7,31,9],[28,4,28,5],[34,13,34,15],[21,13,21,15],[23,13,23,15],[25,13,25,15],[27,13,27,15],[29,13,29,15],[31,13,31,15],[33,13,33,15],[22,13,22,15],[24,13,24,15],[26,13,26,15],[28,13,28,15],[34,7,34,9],[33,7,33,9],[21,7,21,9],[17,4,17,5],[12,7,14,14],[30,1,30,3],[32,1,32,3],[20,7,20,9],[22,7,22,9],[24,7,24,9],[26,7,26,9],[28,7,28,9],[30,7,30,9],[32,7,32,9],[20,1,20,3],[22,1,22,3],[26,1,26,3],[28,1,28,3],[26,4,26,5],[5,7,5,14],[5,1,6,3],[7,1,8,3],[9,1,10,3],[15,1,16,3],[11,1,11,3],[13,1,13,3],[13,4,13,5],[15,4,15,5],[4,1,4,5],[5,4,5,5],[7,4,7,5],[9,4,9,5],[11,4,11,5]]}
[null,{"$f":"Translate!$C$151","v":"INVEST – Payback Tool"}]
[]
[null,{"$f":"Translate!$C$152","v":"This OUTPUT sheet summarises the results as per the entries in the afore completed INPUT sheet."}]
[]
[null,{"$f":"Translate!$C$153","v":"Basic assumptions"}]
[null,{"$f":"Translate!$C$154","v":"Total water need per day"},null,null,{"$f":"'1 INPUT'!E22 & \" \"&Translate!$C$161","v":" m³ per day"},null,null,{"$f":"Translate!$C$173","v":"Note:"}]
[null,null,null,null,null,null,null,{"$f":"Translate!$C$174","v":"If \"not feasible\" is displayed for the Internal Rate of Return (IRR) then the IRR value is below 0%."}]
[null,{"$f":"Translate!$C$155","v":"Total income per year"},null,null,{"$f":"TEXT('1 INPUT'!E24,\"#.##0\") &\" \" & '1 INPUT'!E8","v":".0 "}]
[]
[null,{"$f":"Translate!$C$156","v":"Total investment amount per year"},null,null,{"$f":"TEXT('1 INPUT'!E24,\"#.##0\")*'1 INPUT'!E26 &\" \" & '1 INPUT'!E8","v":"0 "},null,null,{"$f":"Translate!$C$175","v":"If a negative (-) Net Present Value (NPV) is displayed then the investment is not feasible."}]
[]
[null,{"$f":"Translate!$C$157","v":"Inflation"},null,null,{"$f":"'1 INPUT'!E10","v":0}]
[null,null,null,null,null,null,null,{"$f":"Translate!$C$176","v":"If \"no payback\" is displayed for Years for Payback then system capital and/or operating expenses exceed income within 25 years"}]
[null,{"$f":"Translate!$C$158","v":"Discount rate"},null,null,{"$f":"'1 INPUT'!E12","v":0}]
[]
[null,{"$f":"Translate!$C$159","v":"Annual profit margin increase"},null,null,{"$f":"'1 INPUT'!E14","v":0}]
[]
[null,{"$f":"Translate!$C$160","v":"Annual fuel price increase"},null,null,{"$f":"'1 INPUT'!E16","v":0}]
[]
[null,{"$f":"Translate!$C$162&\" \" &'1 INPUT'!D30","v":"Analysis for Solar powered irrigation system"},null,null,null,null,null,{"$f":"Translate!$C$162&\" \" &'1 INPUT'!D60","v":"Analysis for Grid powered irrigation system"},null,null,null,null,null,{"$f":"Translate!$C$162&\" \" &'1 INPUT'!D92","v":"Analysis for Diesel powered irrigation system"}]
{"$rows_left_out":16}
{"sheet":"Translate","index":3,"n_rows":250,"n_cols":7,"rows_kept":250,"cut":false,"hidden":false,"merged":[[1,1,2,2],[4,1,4,8],[6,1,9,1]]}
[]
[null,{"$f":"$C$12","v":"Do not modify this sheet"}]
[]
[]
[null,{"$f":"$C$13","v":"Reference Row"}]
[null,{"$f":"$C$14","v":"Selected Language:"},{"$f":"'READ ME'!$G$11","v":"English"},"English","Français","Español","العربية"]
[null,{"$f":"$C$15","v":"Sheet name"},{"$f":"HLOOKUP($C$6,$D$6:$I$250,ROW()-ROW($B$5),FALSE)","v":"READ ME"},"READ ME","LISER MOI","LÉEME","اقرأ هذه الصفحة"]
[null,null,{"$f":"HLOOKUP($C$6,$D$6:$I$250,ROW()-ROW($B$5),FALSE)","v":"1 INPUT"},"1 INPUT","1 INPUT","1 INPUT","1 إدخال البيانات"]
[null,null,"2 OUTPUT","2 OUTPUT","2 OUTPUT","2 OUTPUT","2 النتائج"]
[null,null,"Translate","Translate","Traduire","Traducción","ترجمة"]
[]
[null,{"$f":"$C$10","v":"Translate"},"Do not modify this sheet","Do not modify this sheet","Ne modifiez pas cette feuille","No modifique esta hoja","لا تعدل هذه الصفحة"]
[null,null,"Reference Row","Reference Row","Ligne de référence","Fila de referencia","صف مرجعي"]
[null,null,"Selected Language:","Selected Language:","Langue sélectionnée:","Idioma seleccionado:","اللغة المختارة:"]
[null,null,"Sheet name","Sheet name","Nom de la feuille","Nombre de la hoja","اسم الصفحة"]
[]
[null,{"$f":"$C$7","v":"READ ME"},"Select language","Select language","Sélectionner la langue","Seleccione el idioma","اختار اللغة"]
[null,null,"Read Me Sheet","Read Me Sheet","Feuille Lisez-moi","Léeme","اقرأ هذه الصفحة"]
[null,null,"INVEST – Payback Tool","INVEST – Payback Tool","INVESTIR- Outil de calcul de remboursement ","INVIERTE - Herramienta de cálculo de amortización "," استثمار - أداة الاسترداد (استرجاع الاستثمار - المردود)"]
[null,null,"Introduction","Introduction","Introduction","Introducción","مقدمة"]
{"$rows_left_out":231}
{"sheet":"Cashflow Calculation","index":4,"n_rows":197,"n_cols":29,"rows_kept":197,"cut":false,"hidden":true,"merged":[[154,1,155,1],[180,5,180,7],[50,1,51,1],[88,1,89,1],[96,13,96,14],[96,15,96,16],[97,13,97,14],[97,15,97,16]]}
["Annual profit margin increase:",{"$f":"'1 INPUT'!E14","v":0}]
["Inflation rate:",{"$f":"'1 INPUT'!E10","v":0}]
["Income-Gross farm profit/year:",{"$f":"'1 INPUT'!E24","v":0},{"$f":"IF('1 INPUT'!$E$8=\"\",\"\",'1 INPUT'!$E$8)","v":""}]
["Percentage profit to invest",{"$f":"'1 INPUT'!E26","v":0}]
["Fuel price increase/year: ",{"$f":"'1 INPUT'!E16","v":0}]
["Electricity price increase/year: ",{"$f":"'1 INPUT'!E18","v":0}]
["Discount rate",{"$f":"'1 INPUT'!E12","v":0}]
["Water levy",{"$f":"'1 INPUT'!E20","v":0},{"$f":"IF('1 INPUT'!$E$8=\"\",\"\",'1 INPUT'!$E$8)","v":""}]
["Total water need per day",{"$f":"'1 INPUT'!E22","v":0},{"$f":"'1 INPUT'!F22","v":"m³ per day "}]
[]
[null,null,"year",0,1,2,3,4,5,6,7,8,9,10,11,12,13,14,15,16,17,18,19,20,21,22,23,24,25]
[null,null,{"$f":"IF('1 INPUT'!$E$8=\"\",\"\",'1 INPUT'!$E$8)","v":""},0,{"$f":"B3*B4","v":0},{"$f":"E12*(1+(1*$B$1))","v":0},{"$f":"F12*(1+(1*$B$1))","v":0},{"$f":"G12*(1+(1*$B$1))","v":0},0,0,0,0,0,0,0,0,0,0,0,0,0,0,0,0,0,0,0,0,0]
["Capital investment per year:"]
[true,null,"accumulated",{"$f":"IF($A$14=TRUE,D15,NA())","v":0},{"$f":"IF($A$14=TRUE,E15,NA())","v":0},{"$f":"IF($A$14=TRUE,F15,NA())","v":0},0,0,0,0,0,0,0,0,0,0,0,0,0,0,0,0,0,0,0,0,0,0,0]
[null,null,null,0,{"$f":"SUM(E12)","v":0},{"$f":"SUM($E$12:F12)","v":0},{"$f":"SUM($E$12:G12)","v":0},{"$f":"SUM($E$12:H12)","v":0},{"$f":"SUM($E$12:I12)","v":0},{"$f":"SUM($E$12:J12)","v":0},{"$f":"SUM($E$12:K12)","v":0},{"$f":"SUM($E$12:L12)","v":0},{"$f":"SUM($E$12:M12)","v":0},{"$f":"SUM($E$12:N12)","v":0},{"$f":"SUM($E$12:O12)","v":0},{"$f":"SUM($E$12:P12)","v":0},{"$f":"SUM($E$12:Q12)","v":0},{"$f":"SUM($E$12:R12)","v":0},{"$f":"SUM($E$12:S12)","v":0},{"$f":"SUM($E$12:T12)","v":0},{"$f":"SUM($E$12:U12)","v":0},{"$f":"SUM($E$12:V12)","v":0},{"$f":"SUM($E$12:W12)","v":0},{"$f":"SUM($E$12:X12)","v":0},{"$f":"SUM($E$12:Y12)","v":0},{"$f":"SUM($E$12:Z12)","v":0},{"$f":"SUM($E$12:AA12)","v":0},{"$f":"SUM($E$12:AB12)","v":0},{"$f":"SUM($E$12:AC12)","v":0}]
[]
[]
[]
[]
[]
{"$rows_left_out":178}
{"sheet":"Loan Repayment Solar","index":5,"n_rows":373,"n_cols":10,"rows_kept":373,"cut":false,"hidden":true,"merged":[[0,0,0,4],[0,5,0,9],[2,1,2,3],[2,5,2,7]]}
["Loan Repayment:",null,null,null,null,{"$f":"'1 INPUT'!D30","v":"Solar powered irrigation system"}]
["Bank:",{"$f":"'1 INPUT'!E56","v":0}]
[null,"Enter Values",null,null,null,"Loan Summary"]
[null,null,"Loan Amount",{"$f":"'1 INPUT'!E53","v":0},null,null,"Scheduled Payment",{"$f":"IF(Values_Entered,-PMT(Interest_Rate/Num_Pmt_Per_Year,Loan_Years*Num_Pmt_Per_Year,Loan_Amount),\"0\")","v":"0"}]
[null,null,"Annual Interest Rate",{"$f":"'1 INPUT'!E54","v":0},null,null,"Scheduled Number of Payments",{"$f":"IF(Values_Entered,Loan_Years*Num_Pmt_Per_Year,\"\")","v":""}]
[null,null,"Loan Period in Years",{"$f":"'1 INPUT'!E55","v":0},null,null,"Actual Number of Payments",{"$f":"IF(Values_Entered,Number_of_Payments,\"\")","v":""}]
[null,null,"Number of Payments Per Year",1,null,null,"Total Early Payments",{"$f":"IF(Values_Entered,SUMIF(Beg_Bal,\">0\",Extra_Pay),\"\")","v":""}]
[null,null,"Start Date of Loan","2017-01-01",null,null,"Total Interest",{"$f":"IF(Values_Entered,SUMIF(Beg_Bal,\">0\",Int),\"\")","v":""}]
[null,null,"Optional Extra Payments",0]
[]
[]
["PmtNo.","Payment Date","Beginning Balance","Scheduled Payment","Extra Payment","Total Payment","Principal","Interest","Ending Balance","Cumulative Interest"]
[]
[{"$f":"IF(Values_Entered,1,\"\")","v":""},{"$f":"IF(Pay_Num<>\"\",DATE(YEAR(Loan_Start),MONTH(Loan_Start)+(Pay_Num)*12/Num_Pmt_Per_Year,DAY(Loan_Start)),\"\")","v":""},{"$f":"IF(Values_Entered,Loan_Amount,\"\")","v":""},{"$f":"IF(Pay_Num<>\"\",Scheduled_Monthly_Payment,\"\")","v":""},{"$f":"IF(AND(Pay_Num<>\"\",Sched_Pay+Scheduled_Extra_Payments<Beg_Bal),Scheduled_Extra_Payments,IF(AND(Pay_Num<>\"\",Beg_Bal-Sched_Pay>0),Beg_Bal-Sched_Pay,IF(Pay_Num<>\"\",0,\"\")))","v":{"$error":"#VALUE!"}},{"$f":"IF(AND(Pay_Num<>\"\",Sched_Pay+Extra_Pay<Beg_Bal),Sched_Pay+Extra_Pay,IF(Pay_Num<>\"\",Beg_Bal,\"\"))","v":{"$error":"#VALUE!"}},{"$f":"IF(Pay_Num<>\"\",Total_Pay-Int,\"\")","v":""},{"$f":"IF(Pay_Num<>\"\",Beg_Bal*(Interest_Rate/Num_Pmt_Per_Year),\"\")","v":""},{"$f":"IF(AND(Pay_Num<>\"\",Sched_Pay+Extra_Pay<Beg_Bal),Beg_Bal-Princ,IF(Pay_Num<>\"\",0,\"\"))","v":{"$error":"#VALUE!"}},{"$f":"SUM($H$14:$H14)","v":0}]
[{"$f":"IF(Values_Entered,A14+1,\"\")","v":""},"",{"$f":"IF(Pay_Num<>\"\",I14,\"\")","v":""},{"$f":"IF(Pay_Num<>\"\",Scheduled_Monthly_Payment,\"\")","v":""},{"$error":"#VALUE!"},{"$error":"#VALUE!"},{"$f":"IF(Pay_Num<>\"\",Total_Pay-Int,\"\")","v":""},{"$f":"IF(Pay_Num<>\"\",Beg_Bal*Interest_Rate/Num_Pmt_Per_Year,\"\")","v":""},{"$error":"#VALUE!"},{"$f":"SUM($H$14:$H15)","v":0}]
[{"$f":"IF(Values_Entered,A15+1,\"\")","v":""},"","",{"$f":"IF(Pay_Num<>\"\",Scheduled_Monthly_Payment,\"\")","v":""},{"$error":"#VALUE!"},{"$error":"#VALUE!"},"","",{"$error":"#VALUE!"},{"$f":"SUM($H$14:$H16)","v":0}]
[{"$f":"IF(Values_Entered,A16+1,\"\")","v":""},"","",{"$f":"IF(Pay_Num<>\"\",Scheduled_Monthly_Payment,\"\")","v":""},{"$error":"#VALUE!"},{"$error":"#VALUE!"},"","",{"$error":"#VALUE!"},{"$f":"SUM($H$14:$H17)","v":0}]
[{"$f":"IF(Values_Entered,A17+1,\"\")","v":""},"","","",{"$error":"#VALUE!"},{"$error":"#VALUE!"},"","",{"$error":"#VALUE!"},{"$f":"SUM($H$14:$H18)","v":0}]
[{"$f":"IF(Values_Entered,A18+1,\"\")","v":""},"","","",{"$error":"#VALUE!"},{"$error":"#VALUE!"},"","",{"$error":"#VALUE!"},{"$f":"SUM($H$14:$H19)","v":0}]
[{"$f":"IF(Values_Entered,A19+1,\"\")","v":""},"","","",{"$error":"#VALUE!"},{"$error":"#VALUE!"},"","",{"$error":"#VALUE!"},{"$f":"SUM($H$14:$H20)","v":0}]
{"$rows_left_out":354}
{"sheet":"Loan Repayment Grid","index":6,"n_rows":373,"n_cols":10,"rows_kept":373,"cut":false,"hidden":true,"merged":[[0,0,0,4],[0,5,0,9],[2,1,2,3],[2,5,2,7]]}
["Loan Repayment:",null,null,null,null,{"$f":"'1 INPUT'!D60","v":"Grid powered irrigation system"}]
["Bank:",{"$f":"'1 INPUT'!E88","v":0}]
[null,"Enter Values",null,null,null,"Loan Summary"]
[null,null,"Loan Amount",{"$f":"'1 INPUT'!E85","v":0},null,null,"Scheduled Payment",{"$f":"IF(Values_Entered,-PMT(Interest_Rate/Num_Pmt_Per_Year,Loan_Years*Num_Pmt_Per_Year,Loan_Amount),\"0\")","v":"0"}]
[null,null,"Annual Interest Rate",{"$f":"'1 INPUT'!E86","v":0},null,null,"Scheduled Number of Payments",{"$f":"IF(Values_Entered,Loan_Years*Num_Pmt_Per_Year,\"\")","v":""}]
[null,null,"Loan Period in Years",{"$f":"'1 INPUT'!E87","v":0},null,null,"Actual Number of Payments",{"$f":"IF(Values_Entered,Number_of_Payments,\"\")","v":""}]
[null,null,"Number of Payments Per Year",1,null,null,"Total Early Payments",{"$f":"IF(Values_Entered,SUMIF(Beg_Bal,\">0\",Extra_Pay),\"\")","v":""}]
[null,null,"Start Date of Loan","2017-01-01",null,null,"Total Interest",{"$f":"IF(Values_Entered,SUMIF(Beg_Bal,\">0\",Int),\"\")","v":""}]
[null,null,"Optional Extra Payments",0]
[]
[]
["PmtNo.","Payment Date","Beginning Balance","Scheduled Payment","Extra Payment","Total Payment","Principal","Interest","Ending Balance","Cumulative Interest"]
[]
[{"$f":"IF(Values_Entered,1,\"\")","v":""},{"$f":"IF(Pay_Num<>\"\",DATE(YEAR(Loan_Start),MONTH(Loan_Start)+(Pay_Num)*12/Num_Pmt_Per_Year,DAY(Loan_Start)),\"\")","v":""},{"$f":"IF(Values_Entered,Loan_Amount,\"\")","v":""},{"$f":"IF(Pay_Num<>\"\",Scheduled_Monthly_Payment,\"\")","v":""},{"$f":"IF(AND(Pay_Num<>\"\",Sched_Pay+Scheduled_Extra_Payments<Beg_Bal),Scheduled_Extra_Payments,IF(AND(Pay_Num<>\"\",Beg_Bal-Sched_Pay>0),Beg_Bal-Sched_Pay,IF(Pay_Num<>\"\",0,\"\")))","v":{"$error":"#VALUE!"}},{"$f":"IF(AND(Pay_Num<>\"\",Sched_Pay+Extra_Pay<Beg_Bal),Sched_Pay+Extra_Pay,IF(Pay_Num<>\"\",Beg_Bal,\"\"))","v":{"$error":"#VALUE!"}},{"$f":"IF(Pay_Num<>\"\",Total_Pay-Int,\"\")","v":""},{"$f":"IF(Pay_Num<>\"\",Beg_Bal*(Interest_Rate/Num_Pmt_Per_Year),\"\")","v":""},{"$f":"IF(AND(Pay_Num<>\"\",Sched_Pay+Extra_Pay<Beg_Bal),Beg_Bal-Princ,IF(Pay_Num<>\"\",0,\"\"))","v":{"$error":"#VALUE!"}},{"$f":"SUM($H$14:$H14)","v":0}]
[{"$f":"IF(Values_Entered,A14+1,\"\")","v":""},"",{"$f":"IF(Pay_Num<>\"\",I14,\"\")","v":""},{"$f":"IF(Pay_Num<>\"\",Scheduled_Monthly_Payment,\"\")","v":""},{"$error":"#VALUE!"},{"$error":"#VALUE!"},{"$f":"IF(Pay_Num<>\"\",Total_Pay-Int,\"\")","v":""},{"$f":"IF(Pay_Num<>\"\",Beg_Bal*Interest_Rate/Num_Pmt_Per_Year,\"\")","v":""},{"$error":"#VALUE!"},{"$f":"SUM($H$14:$H15)","v":0}]
[{"$f":"IF(Values_Entered,A15+1,\"\")","v":""},"","",{"$f":"IF(Pay_Num<>\"\",Scheduled_Monthly_Payment,\"\")","v":""},{"$error":"#VALUE!"},{"$error":"#VALUE!"},"","",{"$error":"#VALUE!"},{"$f":"SUM($H$14:$H16)","v":0}]
[{"$f":"IF(Values_Entered,A16+1,\"\")","v":""},"","",{"$f":"IF(Pay_Num<>\"\",Scheduled_Monthly_Payment,\"\")","v":""},{"$error":"#VALUE!"},{"$error":"#VALUE!"},"","",{"$error":"#VALUE!"},{"$f":"SUM($H$14:$H17)","v":0}]
[{"$f":"IF(Values_Entered,A17+1,\"\")","v":""},"","","",{"$error":"#VALUE!"},{"$error":"#VALUE!"},"","",{"$error":"#VALUE!"},{"$f":"SUM($H$14:$H18)","v":0}]
[{"$f":"IF(Values_Entered,A18+1,\"\")","v":""},"","","",{"$error":"#VALUE!"},{"$error":"#VALUE!"},"","",{"$error":"#VALUE!"},{"$f":"SUM($H$14:$H19)","v":0}]
[{"$f":"IF(Values_Entered,A19+1,\"\")","v":""},"","","",{"$error":"#VALUE!"},{"$error":"#VALUE!"},"","",{"$error":"#VALUE!"},{"$f":"SUM($H$14:$H20)","v":0}]
{"$rows_left_out":354}
{"sheet":"Loan Repayment Diesel","index":7,"n_rows":373,"n_cols":10,"rows_kept":373,"cut":false,"hidden":true,"merged":[[0,0,0,4],[0,5,0,9],[2,1,2,3],[2,5,2,7]]}
["Loan Repayment:",null,null,null,null,{"$f":"'1 INPUT'!D60","v":"Grid powered irrigation system"}]
["Bank:",{"$f":"'1 INPUT'!E119","v":0}]
[null,"Enter Values",null,null,null,"Loan Summary"]
[null,null,"Loan Amount",{"$f":"'1 INPUT'!E116","v":0},null,null,"Scheduled Payment",{"$f":"IF(Values_Entered,-PMT(Interest_Rate/Num_Pmt_Per_Year,Loan_Years*Num_Pmt_Per_Year,Loan_Amount),\"0\")","v":"0"}]
[null,null,"Annual Interest Rate",{"$f":"'1 INPUT'!E117","v":0},null,null,"Scheduled Number of Payments",{"$f":"IF(Values_Entered,Loan_Years*Num_Pmt_Per_Year,\"\")","v":""}]
[null,null,"Loan Period in Years",{"$f":"'1 INPUT'!E118","v":0},null,null,"Actual Number of Payments",{"$f":"IF(Values_Entered,Number_of_Payments,\"\")","v":""}]
[null,null,"Number of Payments Per Year",1,null,null,"Total Early Payments",{"$f":"IF(Values_Entered,SUMIF(Beg_Bal,\">0\",Extra_Pay),\"\")","v":""}]
[null,null,"Start Date of Loan","2017-01-01",null,null,"Total Interest",{"$f":"IF(Values_Entered,SUMIF(Beg_Bal,\">0\",Int),\"\")","v":""}]
[null,null,"Optional Extra Payments",0]
[]
[]
["PmtNo.","Payment Date","Beginning Balance","Scheduled Payment","Extra Payment","Total Payment","Principal","Interest","Ending Balance","Cumulative Interest"]
[]
[{"$f":"IF(Values_Entered,1,\"\")","v":""},{"$f":"IF(Pay_Num<>\"\",DATE(YEAR(Loan_Start),MONTH(Loan_Start)+(Pay_Num)*12/Num_Pmt_Per_Year,DAY(Loan_Start)),\"\")","v":""},{"$f":"IF(Values_Entered,Loan_Amount,\"\")","v":""},{"$f":"IF(Pay_Num<>\"\",Scheduled_Monthly_Payment,\"\")","v":""},{"$f":"IF(AND(Pay_Num<>\"\",Sched_Pay+Scheduled_Extra_Payments<Beg_Bal),Scheduled_Extra_Payments,IF(AND(Pay_Num<>\"\",Beg_Bal-Sched_Pay>0),Beg_Bal-Sched_Pay,IF(Pay_Num<>\"\",0,\"\")))","v":{"$error":"#VALUE!"}},{"$f":"IF(AND(Pay_Num<>\"\",Sched_Pay+Extra_Pay<Beg_Bal),Sched_Pay+Extra_Pay,IF(Pay_Num<>\"\",Beg_Bal,\"\"))","v":{"$error":"#VALUE!"}},{"$f":"IF(Pay_Num<>\"\",Total_Pay-Int,\"\")","v":""},{"$f":"IF(Pay_Num<>\"\",Beg_Bal*(Interest_Rate/Num_Pmt_Per_Year),\"\")","v":""},{"$f":"IF(AND(Pay_Num<>\"\",Sched_Pay+Extra_Pay<Beg_Bal),Beg_Bal-Princ,IF(Pay_Num<>\"\",0,\"\"))","v":{"$error":"#VALUE!"}},{"$f":"SUM($H$14:$H14)","v":0}]
[{"$f":"IF(Values_Entered,A14+1,\"\")","v":""},"",{"$f":"IF(Pay_Num<>\"\",I14,\"\")","v":""},{"$f":"IF(Pay_Num<>\"\",Scheduled_Monthly_Payment,\"\")","v":""},{"$error":"#VALUE!"},{"$error":"#VALUE!"},{"$f":"IF(Pay_Num<>\"\",Total_Pay-Int,\"\")","v":""},{"$f":"IF(Pay_Num<>\"\",Beg_Bal*Interest_Rate/Num_Pmt_Per_Year,\"\")","v":""},{"$error":"#VALUE!"},{"$f":"SUM($H$14:$H15)","v":0}]
[{"$f":"IF(Values_Entered,A15+1,\"\")","v":""},"","",{"$f":"IF(Pay_Num<>\"\",Scheduled_Monthly_Payment,\"\")","v":""},{"$error":"#VALUE!"},{"$error":"#VALUE!"},"","",{"$error":"#VALUE!"},{"$f":"SUM($H$14:$H16)","v":0}]
[{"$f":"IF(Values_Entered,A16+1,\"\")","v":""},"","",{"$f":"IF(Pay_Num<>\"\",Scheduled_Monthly_Payment,\"\")","v":""},{"$error":"#VALUE!"},{"$error":"#VALUE!"},"","",{"$error":"#VALUE!"},{"$f":"SUM($H$14:$H17)","v":0}]
[{"$f":"IF(Values_Entered,A17+1,\"\")","v":""},"","","",{"$error":"#VALUE!"},{"$error":"#VALUE!"},"","",{"$error":"#VALUE!"},{"$f":"SUM($H$14:$H18)","v":0}]
[{"$f":"IF(Values_Entered,A18+1,\"\")","v":""},"","","",{"$error":"#VALUE!"},{"$error":"#VALUE!"},"","",{"$error":"#VALUE!"},{"$f":"SUM($H$14:$H19)","v":0}]
[{"$f":"IF(Values_Entered,A19+1,\"\")","v":""},"","","",{"$error":"#VALUE!"},{"$error":"#VALUE!"},"","",{"$error":"#VALUE!"},{"$f":"SUM($H$14:$H20)","v":0}]
{"$rows_left_out":353}