{"text_format":"2","workbook":"xlsx","n_sheets":11,"sheets":["READ ME","1 General Information","2 Equipment & Assets","3 General Costs & Financing","4 Other Income","5 Seasonal Crops","6 Perennial Crops","7 Livestock","8 Farm Income Statement","Calculation","Crop Price Calculation Sheet"],"not_rendered":{"charts":2,"images":7,"macros":0,"external_links":0,"defined_names":102,"comments":0,"pivot_tables":0},"unopened":[],"bounds":{"document_bytes":16777216,"sheet_cells":100000,"run_cost":"one","rows_first":2000,"rows_last":500,"rows_between":2000,"halvings":0,"cell_chars":16384,"cell_head_chars":4096},"cells_cut":0,"cells_raw":0,"read":"whole","date_system":"1900"}

{"sheet":"READ ME","index":0,"n_rows":110,"n_cols":7,"rows_kept":110,"cut":false,"hidden":false,"merged":[[10,3,10,9],[15,3,15,9],[17,3,17,9],[25,3,25,9],[35,3,35,9],[38,3,39,5],[38,6,39,9],[42,3,43,5],[42,6,43,9],[40,3,41,5],[40,6,41,9],[62,3,62,9],[47,3,49,5],[50,6,52,9],[50,3,52,5],[53,6,55,9],[53,3,55,5],[56,6,57,9],[56,3,57,5],[58,6,60,9],[58,3,60,5],[63,5,63,6],[64,3,65,4],[64,5,65,9],[66,3,66,4],[66,5,66,7],[73,3,84,9],[86,3,99,9],[101,3,107,9],[109,3,109,5],[18,3,23,9],[44,6,46,9],[44,3,46,5],[47,6,49,9],[67,3,67,4],[67,5,67,9],[68,3,70,4],[68,5,69,9],[70,5,70,7],[71,3,71,4],[71,5,71,7],[63,3,63,4]]}
{"$rows_empty":10}
[null,null,null,"Read Me Sheet"]
[]
[]
[]
[]
[null,null,null,"INVEST – Farm Analysis Tool"]
[]
[null,null,null,"Introduction"]
[null,null,null,"This tool allows for assessment on farm productivity and profitability through its average annual agricultural production. The tool is useful for establishing a baseline or to assess the impact of planned investments. This tool allows a SPIS advisor (supplier, development practitioner, extension officer) to support a farm enterprise towards identify unnecessary costs, determine best value agricultural activities and correctly monetize different farm inputs. "]
[]
[]
[]
[]
[]
[]
[null,null,null,"Tips & Tricks"]
{"$rows_empty":9}
[null,null,null,"Overview"]
[null,null,null,"This tool comprises the following sheets:"]
{"$rows_left_out":44}
{"sheet":"1 General Information","index":1,"n_rows":38,"n_cols":10,"rows_kept":38,"cut":false,"hidden":false,"merged":[[0,0,0,9],[5,7,5,9],[11,2,11,7],[17,1,17,9],[18,1,18,9],[1,1,2,9],[7,2,7,9],[8,2,8,4],[10,2,10,4],[9,2,9,4],[4,2,4,4],[4,7,4,9],[5,2,5,4]]}
["INVEST – Farm Analysis Tool"]
[null,"1 GENERAL FARM INFORMATION"]
[]
[]
[null,"Country",{"$nulls":4},"Region"]
[null,"Farm code",{"$nulls":4},"Date"]
[]
[null,"Name of the farm"]
[null,"Village"]
[null,"Division"]
[null,"District"]
[null,"Interviewer"]
[null,"Agricultural planning period (years)",null,null,null,"(year in  four digits each ! )"]
[null,"Currency used for calculation"]
[null,"Area measurement unit",{"$nulls":6},"Conversion factor to 1 ha :"]
[null,"Weight measurement unit",{"$nulls":6},"Conversion factor to 1 kg :"]
[]
[]
[null,"LAND RESOURCES"]
[]
{"$rows_left_out":19}
{"sheet":"2 Equipment & Assets","index":2,"n_rows":38,"n_cols":12,"rows_kept":38,"cut":false,"hidden":false,"merged":[[5,7,8,7],[21,2,21,3],[10,2,10,3],[11,2,11,3],[12,2,12,3],[13,2,13,3],[14,2,14,3],[15,2,15,3],[16,2,16,3],[17,2,17,3],[18,2,18,3],[19,2,19,3],[20,2,20,3],[24,2,24,3],[25,2,25,3],[26,2,26,3],[27,2,27,3],[5,4,8,4],[34,1,34,3],[28,1,28,3],[29,1,29,3],[0,0,0,8],[1,1,1,7],[3,6,3,7],[3,2,3,3],[5,1,9,3],[5,5,8,5],[5,6,8,6],[30,1,30,3],[31,1,31,3],[32,1,32,3],[33,1,33,3],[22,2,22,3],[23,2,23,3]]}
["INVEST – Farm Analysis Tool"]
[null,"2 EQUIPMENT & ASSETS"]
[]
[null,"Annual inflation rate",null,null,null,"Farm code",{"$f":"'1 General Information'!C6","v":0}]
[]
[null,"Type\n\n(Position the mouse on \"Type\" to get suggestions)",null,null,"Today's value of equivalent replacement","Age","Normal life span","Annual depreciation for replacement"]
[]
[]
[]
[{"$nulls":4},{"$f":"'1 General Information'!D14","v":0},"years","years",{"$f":"'1 General Information'!D14","v":0}]
[null,"Please select",{"$nulls":5},{"$f":"IF(G11=0,0,+IF((+G11-F11)<0,\"amorti   \",(E11*((1+$C$4)^(G11-F11)))/G11))","v":0},"Indicative normal life span:","Please select"]
[null,"Please select",{"$nulls":5},{"$f":"IF(G12=0,0,+IF((+G12-F12)<0,\"amorti   \",(E12*((1+$C$4)^(G12-F12)))/G12))","v":0},null,"Baler"]
[null,"Please select",{"$nulls":5},0,"Livestock shed - 20 years","Cereal harvester"]
[null,"Please select",{"$nulls":5},0,"Garage / Workshop - 20 year","Cultivator / tiller"]
[null,"Please select",{"$nulls":5},0,"Storage / warehouse - 20 years","Fertilizer distributor"]
[null,"Please select",{"$nulls":5},0,"Other building - 20 years","Glashouse equipement"]
[null,"Please select",{"$nulls":5},0,"Well / borehole - 20 years","Grass cutter"]
[null,"Please select",{"$nulls":5},0,"Ox cart - 7 years","Irrigation material",null," "]
[null,"Please select",{"$nulls":5},0,"Truck / car - 10 years","Livestock shed / stable"]
[null,"Please select",{"$nulls":5},0,"Tractor - 10 years","Other buildings"]
{"$rows_left_out":19}
{"sheet":"3 General Costs & Financing","index":3,"n_rows":38,"n_cols":15,"rows_kept":38,"cut":false,"hidden":false,"merged":[[0,0,0,14],[24,1,24,14],[26,6,28,6],[26,1,28,1],[26,2,28,2],[26,3,28,3],[26,4,28,4],[26,5,28,5],[26,7,28,7],[25,9,28,9],[26,10,27,14],[3,12,3,13],[1,1,1,14],[2,1,4,3]]}
["INVEST – Farm Analysis Tool"]
[null,"4 COSTS (FIXED and VARIABLE)"]
[null,"Note: The costs listed below are general costs. Costs specifically for seasonal crops, perennial crops and livestock are recorded in seperate sheets"]
[{"$nulls":11},"Farm code",{"$f":"'1 General Information'!C6","v":0}]
[]
[null,"Month","January","February","March","April","May","June","July","August","September","October","November","December","Total"]
[null,"Type of FIXED COSTS",1,2,3,4,5,6,7,8,9,10,11,12]
[null,"Membership fees ",{"$nulls":12},{"$f":"+SUM(C8:N8)","v":0}]
[null,"Insurance costs",{"$nulls":12},{"$f":"+SUM(C9:N9)","v":0}]
[null,"Land tax",{"$nulls":12},0]
[null,"Social fund contribution",{"$nulls":12},0]
[null,"Leasing fees for equipment",{"$nulls":12},0]
[null,"Rental costs for land",{"$nulls":12},{"$f":"+SUM(C13:N13)","v":0}]
[null,"Other fixed costs",{"$nulls":12},0]
[null,"TOTAL FIXED COSTS per month",{"$f":"+SUM(C8:C14)","v":0},0,0,0,0,0,0,0,0,0,0,0,0]
[null,"Month","January","February","March","April","May","June","July","August","September","October","November","December","Total"]
[null,"Type of VARIABLE COSTS",1,2,3,4,5,6,7,8,9,10,11,12]
[null,"Maintenance & repair",{"$nulls":12},0]
[null,"General fuel & lubricants ",{"$nulls":12},0]
[null,"Water, electricity, gas supply",{"$nulls":12},0]
{"$rows_left_out":19}
{"sheet":"4 Other Income","index":4,"n_rows":15,"n_cols":15,"rows_kept":15,"cut":false,"hidden":false,"merged":[[0,0,0,14],[1,1,1,14],[3,12,3,13]]}
["INVEST – Farm Analysis Tool"]
[null,"4 OTHER INCOME"]
[]
[{"$nulls":11},"Farm code",{"$f":"'1 General Information'!C6","v":0}]
[]
[null,"Month","January","February","March","April","May","June","July","August","September","October","November","December","Total"]
[null,"Type of OTHER INCOME",1,2,3,4,5,6,7,8,9,10,11,12]
[null,"Sale of water",{"$nulls":12},{"$f":"+SUM(C8:N8)","v":0}]
[null,"Hire out of equipment",{"$nulls":12},{"$f":"+SUM(C9:N9)","v":0}]
[null,"Lease out storage space",{"$nulls":12},0]
[null,"Lease out land",{"$nulls":12},0]
[null,"Lease out labour",{"$nulls":12},0]
[null,"Other income",{"$nulls":12},{"$f":"+SUM(C13:N13)","v":0}]
[null,"Other income",{"$nulls":12},0]
[null,"TOTAL OTHER INCOME per month",{"$f":"+SUM(C8:C14)","v":0},0,0,0,0,0,0,0,0,0,0,0,0]

{"sheet":"5 Seasonal Crops","index":5,"n_rows":73,"n_cols":10,"rows_kept":73,"cut":false,"hidden":false,"merged":[[0,0,0,6],[1,1,1,6],[7,1,7,6],[20,1,20,6],[62,1,62,6],[51,1,51,6],[24,1,24,6],[30,1,30,6],[36,1,36,6],[44,1,44,6],[58,1,58,6],[19,1,19,6],[3,5,3,6]]}
["INVEST – Farm Analysis Tool"]
[null,"4 SEASONAL CROP GROSS PROFIT CALCULATION"]
[]
[{"$nulls":4},"Farm code",{"$f":"'1 General Information'!C6","v":0}]
[]
[null,"Agricultural land used:",{"$f":"SUM(C10:C14)","v":0},{"$f":"'1 General Information'!D15","v":0}]
[null,null,null,"Unit","Quantity","Unit Price","Value"]
[null,"Sales"]
[null,"Crop types:","Area:"]
[{"$nulls":6},{"$f":"+F10*E10*C10","v":0}]
[{"$nulls":6},{"$f":"+F11*E11*C11","v":0}]
[{"$nulls":6},0]
[{"$nulls":6},0]
[{"$nulls":6},0]
[null,"By-products:"]
[{"$nulls":6},{"$f":"+F16*E16","v":0}]
[{"$nulls":6},0]
[{"$nulls":6},0]
[null,"GROSS PRODUCT",{"$nulls":4},{"$f":"SUM(G10:G18)","v":0}]
[null,"Variable Costs"]
{"$rows_left_out":54}
{"sheet":"6 Perennial Crops","index":6,"n_rows":75,"n_cols":10,"rows_kept":75,"cut":false,"hidden":false,"merged":[[32,1,32,6],[0,0,0,6],[1,1,1,6],[7,1,7,6],[20,1,20,6],[26,1,26,6],[19,1,19,6],[3,5,3,6],[46,1,46,6],[60,1,60,6],[64,1,64,6],[53,1,53,6],[38,1,38,6]]}
["INVEST – Farm Analysis Tool"]
[null,"5 PERENNIAL CROP GROSS PROFIT CALCULATION"]
[]
[{"$nulls":4},"Farm code",{"$f":"'1 General Information'!C6","v":0}]
[]
[null,"Agricultural land used:",{"$f":"SUM(C10:C14)","v":0},{"$f":"'1 General Information'!D15","v":0}]
[null,null,null,"Unit","Quantity","Unit Price","Value"]
[null,"Sales"]
[null,"Crop types:","Area:"]
[{"$nulls":6},{"$f":"+F10*E10*C10","v":0}]
[{"$nulls":6},{"$f":"+F11*E11*C11","v":0}]
[{"$nulls":6},0]
[{"$nulls":6},0]
[{"$nulls":6},0]
[null,"By-products:"]
[{"$nulls":6},{"$f":"+F16*E16","v":0}]
[{"$nulls":6},{"$f":"+F17*E17","v":0}]
[{"$nulls":6},0]
[null,"GROSS PRODUCT",{"$nulls":4},{"$f":"SUM(G10:G18)","v":0}]
[null,"Variable Costs"]
{"$rows_left_out":56}
{"sheet":"7 Livestock","index":7,"n_rows":84,"n_cols":10,"rows_kept":84,"cut":false,"hidden":false,"merged":[[0,0,0,6],[1,1,1,6],[7,1,7,6],[30,1,30,6],[39,1,39,6],[3,5,3,6],[53,1,53,6],[67,1,67,6],[71,1,71,6],[60,1,60,6],[45,1,45,6]]}
["INVEST – Farm Analysis Tool"]
[null,"6 LIVESTOCK GROSS PROFIT CALCULATION"]
[]
[{"$nulls":4},"Farm code",{"$f":"'1 General Information'!C6","v":0}]
[]
[null,"Livestock sold:",{"$f":"SUM(E10:E23)","v":0},"head"]
[null,null,null,"Unit","Quantity","Unit Price","Value"]
[null,"Sales"]
[null,"Livestock type"]
[null,"Dairy cows",null,"head",null,null,{"$f":"+F10*E10","v":0}]
[null,"Heifers",null,"head",null,null,{"$f":"+F11*E11","v":0}]
[null,"Adult steers",null,"head",null,null,0]
[null,"Juvenile steers",null,"head",null,null,0]
[null,"Calfs",null,"head",null,null,0]
[null,"Sheep does",null,"head",null,null,0]
[null,"Sheep bucks",null,"head",null,null,0]
[null,"Sheep kids",null,"head",null,null,0]
[null,"Goat does",null,"head",null,null,0]
[null,"Goat bucks",null,"head",null,null,0]
[null,"Goat kids",null,"head",null,null,0]
{"$rows_left_out":65}
{"sheet":"8 Farm Income Statement","index":8,"n_rows":64,"n_cols":8,"rows_kept":64,"cut":false,"hidden":false,"merged":[[61,3,61,4],[62,3,62,4],[63,3,63,4],[60,5,60,6],[61,5,61,6],[62,5,62,6],[63,5,63,6],[1,1,1,8],[3,6,3,7],[0,0,0,8],[58,3,58,5],[60,3,60,4]]}
["INVEST – Farm Analysis Tool"]
[null,"8 FARM INCOME STATEMENT"]
[]
[{"$nulls":5},"Farm code",{"$f":"'1 General Information'!C6","v":0}]
[]
[null,null,"+","Gross value of seasonal crop production",{"$f":"Calculation!D9","v":0},{"$f":"'1 General Information'!$D$14","v":0},"+",{"$f":"IF($E$16=0,0,(+E6/$E$16)*(1-$E$14))","v":0}]
[null,null,"+","Gross value of seasonal crop by-product production",{"$f":"Calculation!E9","v":0},{"$f":"'1 General Information'!$D$14","v":0},"+",{"$f":"IF($E$16=0,0,(+E7/$E$16)*(1-$E$14))","v":0}]
[null,null,"+","Gross value of perennial crop production",{"$f":"Calculation!D10","v":0},{"$f":"'1 General Information'!$D$14","v":0},"+",0]
[null,null,"+","Gross value of perennial crop by-product production",{"$f":"Calculation!E10","v":0},{"$f":"'1 General Information'!$D$14","v":0},"+",0]
[null,null,"+","Gross value of livestock production: ",{"$f":"Calculation!D11","v":0},{"$f":"'1 General Information'!$D$14","v":0},"+",0]
[null,null,"+","Gross value of livestock by-product production: ",{"$f":"Calculation!E11","v":0},{"$f":"'1 General Information'!$D$14","v":0},"+",0]
[null,null,"+","Gross value of other income: ",{"$f":"'4 Other Income'!O15","v":0},{"$f":"'1 General Information'!$D$14","v":0},"+",0]
[]
[null,null,"-","Anticipated losses of total sales (reduction factor)",0.1,"%"]
[]
[null,null,"=","GROSS FARM INCOME",{"$f":"SUM(E6:E12)-(SUM(E6:E12)*E14)","v":0},{"$f":"'1 General Information'!$D$14","v":0},"=",{"$f":"SUM(H6:H12)","v":0}]
[]
[]
[null,null,"-","Total fixed costs",{"$f":"'3 General Costs & Financing'!O15+('3 General Costs & Financing'!H37*12)","v":0},{"$f":"'1 General Information'!$D$14","v":0},"+",{"$f":"IF($E$22=0,0,+E19/$E$22)","v":0}]
[null,null,"-","Total variable costs (for regular expenses)",{"$f":"'3 General Costs & Financing'!O24+'2 Equipment & Assets'!H38","v":0},{"$f":"'1 General Information'!$D$14","v":0},"+",{"$f":"IF($E$22=0,0,+E20/$E$22)","v":0}]
{"$rows_left_out":11}
{"sheet":"Calculation","index":9,"n_rows":17,"n_cols":19,"rows_kept":17,"cut":false,"hidden":true,"merged":[[1,1,1,18],[0,1,0,18],[3,2,3,5],[5,1,7,1],[6,2,7,2],[6,18,7,18]]}
[null,"DESIGN – Farm Analysis Tool"]
[null,"7 SUMMARY OF GROSS MARGINS"]
[]
[null,"Farm code",{"$f":"'1 General Information'!C6","v":0}]
[]
[null,"Farm Enterprise","Area cultivated / Livestock sold","Gross Main Product","Gross \nBy-product","Gross Prodcut","Seeds / Seedlings / Establishment","Fodder / Fodder Concentrates","Manure / Fertiliser","Veterinary Services","Plant Protection","Labour","Traction / Mechanisation","Infrastructure","Irrigation / Water supply","Other Costs","Total Costs","Revenue","Share of enterprise at total GM"]
[null,null,{"$f":"'1 General Information'!D15&\" / head\"","v":" / head"},{"$f":"'1 General Information'!$D$14","v":0},{"$f":"'1 General Information'!$D$14","v":0},{"$f":"'1 General Information'!$D$14","v":0},{"$f":"'1 General Information'!$D$14","v":0},{"$f":"'1 General Information'!$D$14","v":0},{"$f":"'1 General Information'!$D$14","v":0},{"$f":"'1 General Information'!$D$14","v":0},{"$f":"'1 General Information'!$D$14","v":0},{"$f":"'1 General Information'!$D$14","v":0},{"$f":"'1 General Information'!$D$14","v":0},{"$f":"'1 General Information'!$D$14","v":0},{"$f":"'1 General Information'!$D$14","v":0},{"$f":"'1 General Information'!$D$14","v":0},{"$f":"M7","v":0},{"$f":"Q7","v":0},"%"]
[null,null,null,"total","total","total","total","total","total","total","total","total","total","total","total","total","total","per farm enterprise"]
[null,"Seasonal crops",{"$f":"'5 Seasonal Crops'!C6","v":0},{"$f":"SUM('5 Seasonal Crops'!G10:G14)","v":0},{"$f":"SUM('5 Seasonal Crops'!G16:G18)","v":0},{"$f":"'5 Seasonal Crops'!G19","v":0},{"$f":"'5 Seasonal Crops'!G24","v":0},null,{"$f":"'5 Seasonal Crops'!G30","v":0},null,{"$f":"'5 Seasonal Crops'!G36","v":0},{"$f":"'5 Seasonal Crops'!G44","v":0},{"$f":"'5 Seasonal Crops'!G51","v":0},{"$f":"'5 Seasonal Crops'!G58","v":0},{"$f":"'5 Seasonal Crops'!G62","v":0},{"$f":"'5 Seasonal Crops'!G69","v":0},{"$f":"'5 Seasonal Crops'!G71","v":0},{"$f":"'5 Seasonal Crops'!G73","v":0},{"$f":"IF($R$12=0,0,+R9/$R$12)","v":0}]
[null,"Perennial crops",{"$f":"'6 Perennial Crops'!C6","v":0},{"$f":"SUM('6 Perennial Crops'!G10:G14)","v":0},{"$f":"SUM('6 Perennial Crops'!G16:G18)","v":0},{"$f":"'6 Perennial Crops'!G19","v":0},{"$f":"'6 Perennial Crops'!G26","v":0},null,{"$f":"'6 Perennial Crops'!G32","v":0},null,{"$f":"'6 Perennial Crops'!G38","v":0},{"$f":"'6 Perennial Crops'!G46","v":0},{"$f":"'6 Perennial Crops'!G53","v":0},{"$f":"'6 Perennial Crops'!G60","v":0},{"$f":"'6 Perennial Crops'!G64","v":0},{"$f":"'6 Perennial Crops'!G71","v":0},{"$f":"'6 Perennial Crops'!G73","v":0},{"$f":"'6 Perennial Crops'!G75","v":0},{"$f":"IF($R$12=0,0,+R10/$R$12)","v":0}]
[null,"Livestock",{"$f":"'7 Livestock'!C6","v":0},{"$f":"SUM('7 Livestock'!G10:G23)","v":0},{"$f":"SUM('7 Livestock'!G25:G29)","v":0},{"$f":"'7 Livestock'!G30","v":0},null,{"$f":"'7 Livestock'!G39","v":0},null,{"$f":"'7 Livestock'!G45","v":0},null,{"$f":"'7 Livestock'!G53","v":0},null,{"$f":"'7 Livestock'!G67","v":0},{"$f":"'7 Livestock'!G71","v":0},{"$f":"'7 Livestock'!G80","v":0},{"$f":"'7 Livestock'!G82","v":0},{"$f":"'7 Livestock'!G84","v":0},{"$f":"IF($R$12=0,0,+R11/$R$12)","v":0}]
[null,"Sub-Total (for entire farm)",null,{"$f":"SUM(D9:D11)","v":0},{"$f":"SUM(E9:E11)","v":0},0,0,0,0,0,0,0,0,0,0,0,{"$f":"SUM(Q9:Q11)","v":0},{"$f":"SUM(R9:R11)","v":0},{"$f":"SUM(S9:S11)","v":0}]
[]
[]
[null,"Fixed and Variable Costs",{"$f":"'3 General Costs & Financing'!B8","v":"Membership fees "},{"$f":"'3 General Costs & Financing'!B9","v":"Insurance costs"},{"$f":"'3 General Costs & Financing'!B10","v":"Land tax"},{"$f":"'3 General Costs & Financing'!B11","v":"Social fund contribution"},{"$f":"'3 General Costs & Financing'!B12","v":"Leasing fees for equipment"},{"$f":"'3 General Costs & Financing'!B13","v":"Rental costs for land"},{"$f":"'3 General Costs & Financing'!E38","v":"Total Annual Loan Repayments"},{"$f":"'2 Equipment & Assets'!B38","v":"Total Annual Depreciation "},{"$f":"'3 General Costs & Financing'!B14","v":"Other fixed costs"},{"$f":"'3 General Costs & Financing'!B18","v":"Maintenance & repair"},{"$f":"'3 General Costs & Financing'!B19","v":"General fuel & lubricants "},{"$f":"'3 General Costs & Financing'!B20","v":"Water, electricity, gas supply"},{"$f":"'3 General Costs & Financing'!B21","v":"Regular transport fees "},{"$f":"'3 General Costs & Financing'!B22","v":"Regular staff salary costs"},{"$f":"'3 General Costs & Financing'!B23","v":"Other variable costs"}]
[null,null,{"$f":"'1 General Information'!$D$14","v":0},{"$f":"'1 General Information'!$D$14","v":0},{"$f":"'1 General Information'!$D$14","v":0},{"$f":"'1 General Information'!$D$14","v":0},{"$f":"'1 General Information'!$D$14","v":0},{"$f":"'1 General Information'!$D$14","v":0},{"$f":"'1 General Information'!$D$14","v":0},{"$f":"'1 General Information'!$D$14","v":0},{"$f":"'1 General Information'!$D$14","v":0},{"$f":"'1 General Information'!$D$14","v":0},{"$f":"'1 General Information'!$D$14","v":0},{"$f":"'1 General Information'!$D$14","v":0},{"$f":"'1 General Information'!$D$14","v":0},{"$f":"'1 General Information'!$D$14","v":0},{"$f":"'1 General Information'!$D$14","v":0}]
[null,null,{"$f":"'3 General Costs & Financing'!O8","v":0},{"$f":"'3 General Costs & Financing'!O9","v":0},{"$f":"'3 General Costs & Financing'!O10","v":0},{"$f":"'3 General Costs & Financing'!O11","v":0},{"$f":"'3 General Costs & Financing'!O12","v":0},{"$f":"'3 General Costs & Financing'!O13","v":0},{"$f":"IF('3 General Costs & Financing'!H37=0,('3 General Costs & Financing'!J37*12),('3 General Costs & Financing'!H37*12))","v":0},{"$f":"'2 Equipment & Assets'!H38","v":0},{"$f":"'3 General Costs & Financing'!O14","v":0},{"$f":"'3 General Costs & Financing'!O18","v":0},{"$f":"'3 General Costs & Financing'!O19","v":0},{"$f":"'3 General Costs & Financing'!O20","v":0},{"$f":"'3 General Costs & Financing'!O21","v":0},{"$f":"'3 General Costs & Financing'!O22","v":0},{"$f":"'3 General Costs & Financing'!O23","v":0}]

{"sheet":"Crop Price Calculation Sheet","index":10,"n_rows":45,"n_cols":14,"rows_kept":45,"cut":false,"hidden":false,"merged":[[1,0,1,13],[4,0,4,13],[14,0,14,13],[24,0,24,13],[0,0,0,13]]}
["INVEST – Farm Analysis Tool"]
["Supplementary sheet for calculating average annual costs for selected crops and livestock based on seasonal monthly variations"]
[null,"January","February","March","April","May","June","July","August","September","October","November","December","AVERAGE"]
[null,"Unit price","Unit price","Unit price","Unit price","Unit price","Unit price","Unit price","Unit price","Unit price","Unit price","Unit price","Unit price","Unit price"]
["Seasonal Crops"]
[{"$f":"'5 Seasonal Crops'!B10","v":0},{"$nulls":12},{"$f":"AVERAGE(B6:M6)","v":{"$error":"#DIV/0!"}}]
[{"$f":"'5 Seasonal Crops'!B11","v":0},{"$nulls":12},{"$f":"AVERAGE(B7:M7)","v":{"$error":"#DIV/0!"}}]
[{"$f":"'5 Seasonal Crops'!B12","v":0},{"$nulls":12},{"$error":"#DIV/0!"}]
[{"$f":"'5 Seasonal Crops'!B13","v":0},{"$nulls":12},{"$error":"#DIV/0!"}]
[{"$f":"'5 Seasonal Crops'!B14","v":0},{"$nulls":12},{"$error":"#DIV/0!"}]
[{"$f":"'5 Seasonal Crops'!B15","v":"By-products:"}]
[{"$f":"'5 Seasonal Crops'!B16","v":0},{"$nulls":12},{"$error":"#DIV/0!"}]
[{"$f":"'5 Seasonal Crops'!B17","v":0},{"$nulls":12},{"$error":"#DIV/0!"}]
[{"$f":"'5 Seasonal Crops'!B18","v":0},{"$nulls":12},{"$error":"#DIV/0!"}]
["Perennial crops"]
[{"$f":"'6 Perennial Crops'!B10","v":0},{"$nulls":12},{"$error":"#DIV/0!"}]
[{"$f":"'6 Perennial Crops'!B11","v":0},{"$nulls":12},{"$error":"#DIV/0!"}]
[{"$f":"'6 Perennial Crops'!B12","v":0},{"$nulls":12},{"$error":"#DIV/0!"}]
[{"$f":"'6 Perennial Crops'!B13","v":0},{"$nulls":12},{"$error":"#DIV/0!"}]
[{"$f":"'6 Perennial Crops'!B14","v":0},{"$nulls":12},{"$error":"#DIV/0!"}]
{"$rows_left_out":25}