{"text_format":"2","workbook":"xlsx","n_sheets":12,"sheets":["READ ME","List of dropdown","1 General Information","2 Equipment & Assets","3 Income Crops & Livestock","4 Other Income","5 Financing","6 Fixed and Variable Costs","Graph table","7 Farm Income Statement","Crop Price Calculation Sheet","Quick Check"],"not_rendered":{"charts":1,"images":13,"macros":0,"external_links":0,"defined_names":130,"comments":1,"pivot_tables":0},"unopened":[],"bounds":{"document_bytes":16777216,"sheet_cells":100000,"run_cost":"one","rows_first":2000,"rows_last":500,"rows_between":2000,"halvings":0,"cell_chars":16384,"cell_head_chars":4096},"cells_cut":0,"cells_raw":0,"read":"whole","date_system":"1900"}

{"sheet":"READ ME","index":0,"n_rows":106,"n_cols":7,"rows_kept":106,"cut":false,"hidden":false,"merged":[[69,3,80,9],[82,3,95,9],[97,3,103,9],[105,3,105,5],[18,3,23,9],[44,6,46,9],[44,3,46,5],[41,6,43,9],[63,3,63,4],[63,5,63,9],[64,3,66,4],[64,5,65,9],[66,5,66,7],[67,3,67,4],[67,5,67,7],[59,3,59,4],[59,5,59,6],[60,3,61,4],[60,5,61,9],[62,3,62,4],[62,5,62,7],[58,3,58,9],[41,3,43,5],[51,6,52,9],[51,3,52,5],[47,3,48,5],[47,6,48,9],[53,6,54,9],[53,3,54,5],[55,6,57,9],[55,3,57,5],[37,3,38,5],[37,6,38,9],[49,3,50,5],[49,6,50,9],[39,3,40,5],[39,6,40,9],[10,3,10,9],[15,3,15,9],[17,3,17,9],[25,3,25,9],[35,3,35,9]]}
{"$rows_empty":10}
[null,null,null,"Read Me Sheet"]
[]
[]
[]
[]
[null,null,null,"INVEST – Farm Analysis Tool"]
[]
[null,null,null,"Introduction"]
[null,null,null,"This tool allows for assessment on farm productivity and profitability through its average annual agricultural production. The tool is useful for establishing a baseline or to assess the impact of planned investments. This tool allows a SPIS advisor (supplier, development practitioner, extension officer) to support a farm enterprise towards identify unnecessary costs, determine best value agricultural activities and correctly monetize different farm inputs. "]
[]
[]
[]
[]
[]
[]
[null,null,null,"Tips & Tricks"]
{"$rows_empty":9}
[null,null,null,"Overview"]
[null,null,null,"This tool comprises the following sheets:"]
{"$rows_left_out":40}
{"sheet":"List of dropdown","index":1,"n_rows":19,"n_cols":2,"rows_kept":19,"cut":false,"hidden":true,"merged":[]}
[]
["Area","CF to ha"]
["ha",1]
["Acre",2.47105]
["Sq. km",0.01]
["Sq. m",10000]
["Sq. yard",11959.9]
["Sq. ft",107639]
[]
["Conversion Factor",{"$f":"VLOOKUP('1 General Information'!D14,'List of dropdown'!A3:B8,2,FALSE)","v":1}]
[]
[]
["Weight","CF to kg"]
["kg",1]
["metric ton",1000]
["quintal",100]
["pound (lb)",0.4536]
[]
["Conversion Factor",{"$f":"VLOOKUP('1 General Information'!D15,'List of dropdown'!A14:B17,2,FALSE)","v":1}]

{"sheet":"1 General Information","index":2,"n_rows":37,"n_cols":10,"rows_kept":37,"cut":false,"hidden":false,"merged":[[0,0,0,9],[5,7,5,9],[10,2,10,7],[16,1,16,9],[17,1,17,9],[1,1,2,9],[7,2,7,4],[9,2,9,4],[8,2,8,4],[4,2,4,4],[5,2,5,4],[4,7,4,9]]}
["INVEST – Farm Analysis Tool"]
[null,"1 GENERAL FARM INFORMATION"]
[]
[]
[null,"Country",{"$nulls":4},"Region"]
[null,"Farm code or name",{"$nulls":4},"Date"]
[]
[null,"Village"]
[null,"Division"]
[null,"District"]
[null,"Assessor"]
[null,"Agricultural planning period (years)",null,2018,2019,"(year in  four digits each ! )"]
[null,"Currency used for calculation",null,"€"]
[null,"Area measurement unit",null,"ha",{"$nulls":4},"Conversion factor to 1 ha :",{"$f":"'List of dropdown'!B10","v":1}]
[null,"Weight measurement unit",null,"kg",{"$nulls":4},"Conversion factor to 1 kg :",{"$f":"'List of dropdown'!B19","v":1}]
[]
[]
[null,"LAND RESOURCES"]
[]
[null,"Property rights",null,"Area"]
{"$rows_left_out":18}
{"sheet":"2 Equipment & Assets","index":3,"n_rows":38,"n_cols":9,"rows_kept":38,"cut":false,"hidden":false,"merged":[[37,2,37,4],[5,6,8,6],[5,3,8,3],[5,2,8,2],[0,0,0,7],[1,1,1,6],[3,5,3,6],[5,1,9,1],[5,4,8,4],[5,5,8,5]]}
["INVEST – Farm Analysis Tool"]
[null,"2 EQUIPMENT & ASSETS"]
[]
[{"$nulls":4},"Farm code",{"$f":"'1 General Information'!C6","v":0}]
[]
[null,"Type\n\n","Cost of existing equipment (when originally purchased)","Salvage value (when selling existing equipment)","Age","Normal life span","Annual depreciation for replacement"]
[]
[]
[]
[null,null,{"$f":"'1 General Information'!D13","v":"€"},{"$f":"'1 General Information'!D13","v":"€"},"years","years",{"$f":"'1 General Information'!D13","v":"€"}]
[null,"Livestock shed",60000,10000,2,20,{"$f":"IFERROR(SLN(C11,D11,(F11-E11)),\"\")","v":2777.7777777777778},"Indicative normal life span:","Please select"]
[null,"Please select",{"$nulls":4},{"$f":"IFERROR(SLN(C12,D12,(F12-E12)),\"\")","v":""},"(highly quality dependent!)"]
[null,"Please select",{"$nulls":4},"","Livestock shed - 20 years","Livestock shed"]
[null,"Please select",{"$nulls":4},"","Garage / workshop - 20 year","Garage / workshop"]
[null,"Please select",{"$nulls":4},"","Storage / warehouse - 20 years","Storage / warehouse"]
[null,"Please select",{"$nulls":4},"","Greenhouse - 10 years","Greenhouse"]
[null,"Please select",{"$nulls":4},{"$f":"IFERROR(SLN(C17,D17,(F17-E17)),\"\")","v":""},"Other building - 20 years","Other building"]
[null,"Please select",{"$nulls":4},"","Ox cart - 7 years","Ox cart"]
[null,"Please select",{"$nulls":4},"","Truck / car - 10 years","Truck / car"]
[null,"Please select",{"$nulls":4},"","Tractor - 10 years","Tractor"]
{"$rows_left_out":19}
{"sheet":"3 Income Crops & Livestock","index":4,"n_rows":63,"n_cols":15,"rows_kept":63,"cut":false,"hidden":false,"merged":[[56,10,56,12],[54,10,54,14],[57,10,57,12],[58,10,58,12],[61,10,61,12],[59,10,60,14],[62,1,62,5],[0,0,0,6],[35,1,35,6],[40,1,40,2],[40,3,40,6],[38,3,38,4],[1,1,1,6],[3,5,3,6],[7,1,7,6],[19,1,19,6],[23,1,23,6],[18,1,18,5],[34,1,34,5],[30,10,30,14],[32,10,32,12],[33,10,33,12],[34,10,34,12],[35,10,35,12]]}
["INVEST – Farm Analysis Tool"]
[null,"INCOME: SEASONAL CROP"]
[]
[{"$nulls":4},"Farm code",{"$f":"'1 General Information'!C6","v":0}]
[]
[null,"Agricultural land used:",{"$f":"SUM(C10:C14)","v":0},{"$f":"'1 General Information'!D14","v":"ha"}]
[null,null,null,"Unit",{"$f":"\"Yield per \"& '1 General Information'!D14 &\" or Quantity\"","v":"Yield per ha or Quantity"},"Unit Price","Value"]
[null,"Sales"]
[null,"Crop types:","Area:"]
[{"$nulls":6},{"$f":"+F10*E10*C10","v":0}]
[{"$nulls":6},{"$f":"+F11*E11*C11","v":0}]
[{"$nulls":6},0]
[{"$nulls":6},0]
[{"$nulls":6},0]
[null,"By-products:"]
[{"$nulls":6},{"$f":"+F16*E16","v":0}]
[{"$nulls":6},0]
[{"$nulls":6},0]
[null,"GROSS INCOME",{"$nulls":4},{"$f":"SUM(G10:G18)","v":0}]
[null,"INCOME: PERENNIAL CROP"]
{"$rows_left_out":44}
{"sheet":"4 Other Income","index":5,"n_rows":15,"n_cols":15,"rows_kept":15,"cut":false,"hidden":false,"merged":[[0,0,0,14],[1,1,1,14],[3,12,3,13],[3,10,3,11]]}
["INVEST – Farm Analysis Tool"]
[null,"4 OTHER INCOME"]
[]
[{"$nulls":10},"Farm code",null,{"$f":"'1 General Information'!C6","v":0}]
[]
[null,"Month","January","February","March","April","May","June","July","August","September","October","November","December","Total"]
[null,"Type of OTHER INCOME",1,2,3,4,5,6,7,8,9,10,11,12]
[null,"Sale of water",{"$nulls":12},{"$f":"+SUM(C8:N8)","v":0}]
[null,"Hire out of equipment",{"$nulls":12},{"$f":"+SUM(C9:N9)","v":0}]
[null,"Lease out storage space",{"$nulls":12},{"$f":"+SUM(C10:N10)","v":0}]
[null,"Lease out land",{"$nulls":12},0]
[null,"Lease out labour",{"$nulls":12},{"$f":"+SUM(C12:N12)","v":0}]
[{"$nulls":14},{"$f":"+SUM(C13:N13)","v":0}]
[{"$nulls":14},{"$f":"+SUM(C14:N14)","v":0}]
[null,"TOTAL OTHER INCOME per month",{"$f":"+SUM(C8:C14)","v":0},0,0,0,0,0,0,0,0,0,0,0,{"$f":"+SUM(O8:O14)","v":0}]

{"sheet":"5 Financing","index":6,"n_rows":17,"n_cols":11,"rows_kept":17,"cut":false,"hidden":false,"merged":[[0,0,0,13],[1,0,1,13],[4,8,7,8],[5,0,7,0],[5,1,7,1],[5,2,7,2],[5,3,7,3],[5,4,7,4],[5,5,7,5],[5,6,7,6],[5,9,15,13],[3,10,3,12],[4,0,4,6]]}
["INVEST – Farm Analysis Tool"]
["CREDIT AND FINANCING (simplified calculator, to be confirmed with loan provider)"]
[]
[{"$nulls":9},"Farm code",{"$f":"'1 General Information'!C6","v":0}]
["Calculator",{"$nulls":7},"Enter manually:"]
["Bank name","Loan amount","Credit period (years)","Month of taking credit","Year of taking credit","Annual interest rate","Monthly loan repayment",null,null,"Note: the Calculator value will take precedence to the manual value. Ensure calculator value is 0 in order to use manual value."]
[{"$nulls":7},"OR"]
[]
[null,7000,3,1,2018,0.08,{"$f":"IF(D9,-PMT(F9/12,C9*12,B9),\"0\")","v":219.35455823001593}]
[{"$nulls":6},{"$f":"IF(D10,-PMT(F10/12,C10*12,B10),\"0\")","v":"0"}]
[{"$nulls":6},{"$f":"IF(D11,-PMT(F11/12,C11*12,B11),\"0\")","v":"0"}]
[{"$nulls":6},"0"]
[{"$nulls":6},"0"]
[{"$nulls":6},"0"]
[{"$nulls":6},"0"]
["TOTAL CREDIT",{"$f":"SUM(B9:B15)","v":7000},{"$nulls":4},{"$f":"SUM(G9:G15)","v":219.35455823001593},null,{"$f":"SUM(I9:I14)","v":0}]
[null,null,null,"Total Annual Loan Repayments",null,null,{"$f":"G16*12","v":2632.2546987601909},null,{"$f":"I16*12","v":0}]

{"sheet":"6 Fixed and Variable Costs","index":7,"n_rows":39,"n_cols":15,"rows_kept":39,"cut":false,"hidden":false,"merged":[[5,1,6,1],[20,1,20,14],[0,0,0,14],[3,12,3,13],[1,1,1,14],[2,1,4,3]]}
["INVEST – Farm Analysis Tool"]
[null,"4 COSTS (FIXED and VARIABLE)"]
[]
[{"$nulls":11},"Farm code",{"$f":"'1 General Information'!C6","v":0}]
[]
[null,"Month","January","February","March","April","May","June","July","August","September","October","November","December","Total"]
[null,null,1,2,3,4,5,6,7,8,9,10,11,12]
[null,"FIXED COSTS"]
[null,"Financing fees",{"$f":"'5 Financing'!$G$16","v":219.35455823001593},{"$f":"'5 Financing'!$G$16","v":219.35455823001593},{"$f":"'5 Financing'!$G$16","v":219.35455823001593},{"$f":"'5 Financing'!$G$16","v":219.35455823001593},{"$f":"'5 Financing'!$G$16","v":219.35455823001593},{"$f":"'5 Financing'!$G$16","v":219.35455823001593},{"$f":"'5 Financing'!$G$16","v":219.35455823001593},{"$f":"'5 Financing'!$G$16","v":219.35455823001593},{"$f":"'5 Financing'!$G$16","v":219.35455823001593},{"$f":"'5 Financing'!$G$16","v":219.35455823001593},{"$f":"'5 Financing'!$G$16","v":219.35455823001593},{"$f":"'5 Financing'!$G$16","v":219.35455823001593},{"$f":"+SUM(C9:N9)","v":2632.2546987601909}]
[null,"Depreciation costs",{"$f":"'2 Equipment & Assets'!$G$38/12","v":231.4814814814815},{"$f":"'2 Equipment & Assets'!$G$38/12","v":231.4814814814815},{"$f":"'2 Equipment & Assets'!$G$38/12","v":231.4814814814815},{"$f":"'2 Equipment & Assets'!$G$38/12","v":231.4814814814815},{"$f":"'2 Equipment & Assets'!$G$38/12","v":231.4814814814815},{"$f":"'2 Equipment & Assets'!$G$38/12","v":231.4814814814815},{"$f":"'2 Equipment & Assets'!$G$38/12","v":231.4814814814815},{"$f":"'2 Equipment & Assets'!$G$38/12","v":231.4814814814815},{"$f":"'2 Equipment & Assets'!$G$38/12","v":231.4814814814815},{"$f":"'2 Equipment & Assets'!$G$38/12","v":231.4814814814815},{"$f":"'2 Equipment & Assets'!$G$38/12","v":231.4814814814815},{"$f":"'2 Equipment & Assets'!$G$38/12","v":231.4814814814815},{"$f":"+SUM(C10:N10)","v":2777.7777777777774}]
[null,"Membership fees ",{"$nulls":12},{"$f":"+SUM(C11:N11)","v":0}]
[null,"Insurance costs",{"$nulls":12},{"$f":"+SUM(C12:N12)","v":0}]
[null,"Land tax",{"$nulls":12},0]
[null,"Social fund contribution",{"$nulls":12},{"$f":"+SUM(C14:N14)","v":0}]
[null,"Leasing fees for equipment",{"$nulls":12},0]
[null,"Rental costs for land",{"$nulls":12},{"$f":"+SUM(C16:N16)","v":0}]
[null,"-",{"$nulls":12},{"$f":"+SUM(C17:N17)","v":0}]
[null,"-",{"$nulls":12},0]
[null,"TOTAL FIXED COSTS per month",{"$f":"+SUM(C9:C18)","v":450.83603971149739},{"$f":"+SUM(D9:D18)","v":450.83603971149739},450.83603971149739,450.83603971149739,450.83603971149739,450.83603971149739,450.83603971149739,450.83603971149739,450.83603971149739,450.83603971149739,450.83603971149739,450.83603971149739,{"$f":"+SUM(O9:O18)","v":5410.0324765379683}]
[]
{"$rows_left_out":20}
{"sheet":"Graph table","index":8,"n_rows":33,"n_cols":3,"rows_kept":33,"cut":false,"hidden":true,"merged":[]}
[]
[]
[]
[]
[]
[]
["FIXED COSTS",{"$f":"'6 Fixed and Variable Costs'!B9","v":"Financing fees"},{"$f":"'6 Fixed and Variable Costs'!O9","v":2632.2546987601909}]
[null,{"$f":"'6 Fixed and Variable Costs'!B10","v":"Depreciation costs"},{"$f":"'6 Fixed and Variable Costs'!O10","v":2777.7777777777774}]
[null,{"$f":"'6 Fixed and Variable Costs'!B11","v":"Membership fees "},{"$f":"'6 Fixed and Variable Costs'!O11","v":0}]
[null,{"$f":"'6 Fixed and Variable Costs'!B12","v":"Insurance costs"},{"$f":"'6 Fixed and Variable Costs'!O12","v":0}]
[null,{"$f":"'6 Fixed and Variable Costs'!B13","v":"Land tax"},{"$f":"'6 Fixed and Variable Costs'!O13","v":0}]
[null,{"$f":"'6 Fixed and Variable Costs'!B14","v":"Social fund contribution"},{"$f":"'6 Fixed and Variable Costs'!O14","v":0}]
[null,{"$f":"'6 Fixed and Variable Costs'!B15","v":"Leasing fees for equipment"},{"$f":"'6 Fixed and Variable Costs'!O15","v":0}]
[null,{"$f":"'6 Fixed and Variable Costs'!B16","v":"Rental costs for land"},{"$f":"'6 Fixed and Variable Costs'!O16","v":0}]
[null,{"$f":"'6 Fixed and Variable Costs'!B17","v":"-"},{"$f":"'6 Fixed and Variable Costs'!O17","v":0}]
[null,{"$f":"'6 Fixed and Variable Costs'!B18","v":"-"},{"$f":"'6 Fixed and Variable Costs'!O18","v":0}]
[{"$f":"'6 Fixed and Variable Costs'!B21","v":"VARIABLE COSTS"},{"$f":"'6 Fixed and Variable Costs'!B22","v":"Fuel and gas costs"},{"$f":"'6 Fixed and Variable Costs'!O22","v":0}]
[null,{"$f":"'6 Fixed and Variable Costs'!B23","v":"Water fees"},{"$f":"'6 Fixed and Variable Costs'!O23","v":0}]
[null,{"$f":"'6 Fixed and Variable Costs'!B24","v":"Electricity fees"},{"$f":"'6 Fixed and Variable Costs'!O24","v":0}]
[null,{"$f":"'6 Fixed and Variable Costs'!B25","v":"Transport fees "},{"$f":"'6 Fixed and Variable Costs'!O25","v":0}]
{"$rows_left_out":14}
{"sheet":"7 Farm Income Statement","index":9,"n_rows":64,"n_cols":10,"rows_kept":64,"cut":false,"hidden":false,"merged":[[63,3,63,7],[1,1,1,8],[3,6,3,7],[0,0,0,8],[57,3,57,5],[59,3,59,4],[60,3,60,4],[61,3,61,4],[62,3,62,4],[59,5,59,6],[60,5,60,6],[61,5,61,6],[62,5,62,6]]}
["INVEST – Farm Analysis Tool"]
[null,"8 FARM INCOME STATEMENT"]
[]
[{"$nulls":5},"Farm code",{"$f":"'1 General Information'!C6","v":0}]
[]
[null,null,"+","Gross value of seasonal crop production",{"$f":"SUM('3 Income Crops & Livestock'!G10:G14)","v":0},{"$f":"'1 General Information'!$D$13","v":"€"},"+",{"$f":"IF($E$16=0,0,(+E6/$E$16)*(1-$E$14))","v":0}]
[null,null,"+","Gross value of seasonal crop by-product production",{"$f":"SUM('3 Income Crops & Livestock'!G16:G18)","v":0},{"$f":"'1 General Information'!$D$13","v":"€"},"+",{"$f":"IF($E$16=0,0,(+E7/$E$16)*(1-$E$14))","v":0}]
[null,null,"+","Gross value of perennial crop production",{"$f":"SUM('3 Income Crops & Livestock'!G26:G30)","v":0},{"$f":"'1 General Information'!$D$13","v":"€"},"+",0]
[null,null,"+","Gross value of perennial crop by-product production",{"$f":"SUM('3 Income Crops & Livestock'!G32:G34)","v":0},{"$f":"'1 General Information'!$D$13","v":"€"},"+",0]
[null,null,"+","Gross value of livestock production: ",{"$f":"SUM('3 Income Crops & Livestock'!G43:G56)","v":0},{"$f":"'1 General Information'!$D$13","v":"€"},"+",0]
[null,null,"+","Gross value of livestock by-product production: ",{"$f":"SUM('3 Income Crops & Livestock'!G58:G62)","v":0},{"$f":"'1 General Information'!$D$13","v":"€"},"+",0]
[null,null,"+","Gross value of other income: ",{"$f":"'4 Other Income'!O15","v":0},{"$f":"'1 General Information'!$D$13","v":"€"},"+",0]
[]
[null,null,"-","Anticipated losses of total sales (reduction factor)",0.1,"%"]
[]
[null,null,"=","GROSS FARM INCOME",{"$f":"SUM(E6:E12)-(SUM(E6:E12)*E14)","v":0},{"$f":"'1 General Information'!$D$13","v":"€"},"=",{"$f":"SUM(H6:H12)","v":0}]
[]
[]
[null,null,"-","Total fixed costs",{"$f":"'6 Fixed and Variable Costs'!O19","v":5410.0324765379683},{"$f":"'1 General Information'!$D$13","v":"€"},"+",{"$f":"IF($E$21=0,0,+E19/$E$21)","v":1}]
[null,null,"-","Total variable costs",{"$f":"'6 Fixed and Variable Costs'!O39","v":0},{"$f":"'1 General Information'!$D$13","v":"€"},"+",{"$f":"IF($E$21=0,0,+E20/$E$21)","v":0}]
{"$rows_left_out":11}
{"sheet":"Crop Price Calculation Sheet","index":10,"n_rows":45,"n_cols":14,"rows_kept":45,"cut":false,"hidden":false,"merged":[[1,0,1,13],[4,0,4,13],[14,0,14,13],[24,0,24,13],[0,0,0,13]]}
["INVEST – Farm Analysis Tool"]
["Supplementary sheet for calculating average annual costs for selected crops and livestock based on seasonal monthly variations"]
[null,"January","February","March","April","May","June","July","August","September","October","November","December","AVERAGE"]
[null,"Unit price","Unit price","Unit price","Unit price","Unit price","Unit price","Unit price","Unit price","Unit price","Unit price","Unit price","Unit price","Unit price"]
["Seasonal Crops"]
[{"$f":"'3 Income Crops & Livestock'!B10","v":0},{"$nulls":12},{"$f":"AVERAGE(B6:M6)","v":{"$error":"#DIV/0!"}}]
[{"$f":"'3 Income Crops & Livestock'!B11","v":0},{"$nulls":12},{"$f":"AVERAGE(B7:M7)","v":{"$error":"#DIV/0!"}}]
[{"$f":"'3 Income Crops & Livestock'!B12","v":0},{"$nulls":12},{"$error":"#DIV/0!"}]
[{"$f":"'3 Income Crops & Livestock'!B13","v":0},{"$nulls":12},{"$error":"#DIV/0!"}]
[{"$f":"'3 Income Crops & Livestock'!B14","v":0},{"$nulls":12},{"$error":"#DIV/0!"}]
[{"$f":"'3 Income Crops & Livestock'!B15","v":"By-products:"}]
[{"$f":"'3 Income Crops & Livestock'!B16","v":0},{"$nulls":12},{"$error":"#DIV/0!"}]
[{"$f":"'3 Income Crops & Livestock'!B17","v":0},{"$nulls":12},{"$error":"#DIV/0!"}]
[{"$f":"'3 Income Crops & Livestock'!B18","v":0},{"$nulls":12},{"$error":"#DIV/0!"}]
["Perennial crops"]
[{"$f":"'3 Income Crops & Livestock'!B26","v":0},{"$nulls":12},{"$error":"#DIV/0!"}]
[{"$f":"'3 Income Crops & Livestock'!B27","v":0},{"$nulls":12},{"$error":"#DIV/0!"}]
[{"$f":"'3 Income Crops & Livestock'!B28","v":0},{"$nulls":12},{"$error":"#DIV/0!"}]
[{"$f":"'3 Income Crops & Livestock'!B29","v":0},{"$nulls":12},{"$error":"#DIV/0!"}]
[{"$f":"'3 Income Crops & Livestock'!B30","v":0},{"$nulls":12},{"$error":"#DIV/0!"}]
{"$rows_left_out":26}
{"sheet":"Quick Check","index":11,"n_rows":33,"n_cols":9,"rows_kept":33,"cut":false,"hidden":false,"merged":[[0,0,0,3],[1,1,1,3],[32,1,32,3],[6,5,6,8],[33,2,33,3],[4,1,4,3],[18,1,18,3]]}
["INVEST – Farm Analysis Tool"]
[null,"QUICK CHECK"]
[]
[]
[null,"Annual Expenditure"]
[null,"Expenditure Type","Examples","Annual Amount"]
[null,"Seasonal crop expenses","Seedlings, pesticides, fertilisers, protection, etc",null,null,"Calculator"]
[null,"Perennial crop expenses","Seedlings, pesticides, fertilisers, protection, etc",null,null,null,"add up:","multiply:","divide:"]
[null,"Livestock expenses","New livestock, fodder, slaughtering, veterinary services, etc",null,null,"a."]
[null,"Operation and maintenance \n- Infrastructure","Building renovations, painting, plastering, fencing, electricity, water, etc ",null,null,"b."]
[null,"Operation and maintenance\n- Fixed equipment","Water pumps, irrigation equipment, packaging equipment, milling, fuel, spare parts, repairs, etc",null,null,"c."]
[null,"Operation and maintenance \n- Movable equipment","Tractor, trucks, plough, trailer, fuel, spare parts, repairs, etc",null,null,"d."]
[null,"Labour","Salaries, benefits, own salary (?) etc",null,null,"e."]
[null,"Sales and distribution","Packaging, fees, advertising, etc",null,null,"Total",{"$f":"SUM(G9:G13)","v":0},{"$f":"H9*H10","v":0},{"$f":"I9/I10","v":{"$error":"#DIV/0!"}}]
[null,"Management and administration","Rent, office consumables, insurance, memberships, loan repayments, etc"]
[]
[null,null,null,{"$f":"SUM(D7:D16)","v":0}]
[]
[null,"Annual Income"]
[null,"Income Type","Examples","Annual Amount"]
{"$rows_left_out":13}