{"text_format":"2","workbook":"xlsx","n_sheets":9,"sheets":["READ ME","INPUT_Pre-check","INPUT_Weight setting"," INPUT_Geophysical Parameters","INPUT_Business Conditions","OUTPUT_Result","Calculations","Lists","Lists 2"],"not_rendered":{"charts":9,"images":66,"macros":0,"external_links":2,"defined_names":20,"comments":1,"pivot_tables":0},"unopened":[],"bounds":{"document_bytes":16777216,"sheet_cells":100000,"run_cost":"one","rows_first":2000,"rows_last":500,"rows_between":2000,"halvings":0,"cell_chars":16384,"cell_head_chars":4096},"cells_cut":0,"cells_raw":0,"read":"whole","date_system":"1900"}

{"sheet":"READ ME","index":0,"n_rows":39,"n_cols":3,"rows_kept":39,"cut":false,"hidden":false,"merged":[]}
[]
[null,null,"Read Me Sheet"]
[]
[]
[]
[]
[null,null,"MARKET – Market Assessment Tool"]
[]
[null,null,"Introduction"]
[null,null,"This tool complements the module MARKET in the SPIS Toolbox. The tool serves to determine geophysical parameters highlighted as make or break. If any of the parameters scores a 0, the area is considered to have very poor potential for SPIS. A ‘yes’ from this evaluation allows consideration of other parameters."]
[]
[null,null,"Tips & Tricks"]
{"$rows_empty":8}
[null,null,"Overview"]
[null,null,"This tool comprises the following sheets:"]
[null,null,"Input_Pre-check: Allows a first check for SPIS suitability to proceed with the assessment"]
[null,null,"Input_Weight setting: Provides a description of parameters and allows for adjusting weights"]
[null,null,"Input_Geophysical Conditions: For defining geophysical parameters in the target area"]
[null,null,"Input_Business Conditions: For defining business relevant parameters relevant to the target area"]
[null,null,"Output_Results: Shows graphic overview of the market potential of SPIS within an area"]
{"$rows_left_out":13}
{"sheet":"INPUT_Pre-check","index":1,"n_rows":32,"n_cols":20,"rows_kept":32,"cut":false,"hidden":false,"merged":[[13,19,16,19],[15,17,16,17],[15,18,16,18],[3,0,3,15],[7,3,7,11],[8,3,8,11],[15,0,19,0],[16,6,17,6],[16,7,17,7],[16,8,17,8],[16,9,17,9],[16,10,17,10],[1,4,1,10],[2,4,2,12],[18,14,19,14],[15,15,19,15],[9,1,9,8],[5,3,5,11],[6,3,6,11],[14,2,14,7],[14,8,14,13],[15,1,17,1],[15,14,17,14],[16,13,17,13],[16,11,17,11],[16,12,17,12],[16,5,17,5],[21,1,22,15],[12,2,12,13],[13,2,13,13],[10,0,11,0],[10,1,11,13],[16,2,17,2],[16,3,17,3],[16,4,17,4],[15,2,15,7],[15,8,15,13]]}
[]
[{"$nulls":4},"INPUT - First Pre-Check"]
[]
[]
[]
[null,"Country:",null," Kenya"]
[null,"Specific area of interest:"]
[null,"Assessment date:"]
[null,"Assessor name:"]
[]
[1,"Critical Geophysical Parameters",{"$nulls":12},"Highest Possible Score","Attained Score"]
[{"$nulls":14},9,{"$f":"IF(COUNTIF(S14:S17,0)=0,S14+S15+S16,0)","v":9}]
[null,"Questions","Sample Data Sources",{"$nulls":11},"Answer","Suitability",null,"Parameter","Score","Raw Score"]
["a)",{"$f":"\"What is the major land cover found in the\"&'INPUT_Pre-check'!D6&\"?\"","v":"What is the major land cover found in the Kenya?"},"Global Land Cover\n",{"$nulls":11},"Mosaic crop land with natural vegetation",{"$f":"VLOOKUP(O14,'Lists 2'!A:B,2,0)","v":"Highly Suitable"},null,"Land Cover",{"$f":"IF(P14=\"Highly Suitable\", \"3\", IF(P14=\"Moderately Suitable\", \"2\", IF(P14=\"Marginally Suitable\", \"1\", \"0\")))","v":"3"},{"$f":"IF(COUNTIF(S14:S17,0)=0,S14+S15+S16,0)","v":9}]
["b)",{"$f":"\"What is the average annual solar irradiation in the \"&'INPUT_Pre-check'!D6&\"? (kWh/kW peak - PVOUT value)\"","v":"What is the average annual solar irradiation in the  Kenya? (kWh/kW peak - PVOUT value)"},"World Bank Solar map\n\n\n",{"$nulls":5},"IRENA global atlas for renewable energy ",{"$nulls":5},"Above 1460",{"$f":"IF(O15=\"0 - 948\", \"Not Suitable\", IF(O15=\"949 - 1094\", \"Marginally Suitable\", IF(O15=\"1095 - 1460\", \"Moderately Suitable\", \"Highly Suitable\")))","v":"Highly Suitable"},null,"Solar Irradiation",{"$f":"IF(O15=\"Above 1460\", \"3\", IF(O15=\"1095 - 1460\", \"2\", IF(O15=\"949 - 1094\", \"1\", \"0\")))","v":"3"}]
["c)",{"$f":"\"What are the average monthly temperature and precipitation values in \"&'INPUT_Pre-check'!D6&\"?\"","v":"What are the average monthly temperature and precipitation values in  Kenya?"},"\nWorld Bank Global Precipitation Data\n",{"$nulls":5},"World Climate.com",{"$nulls":5},"Amount of arid months",{"$f":"IF(O19=0, \"Low Irrigation Requirement\",IF(O19=1,\"Marginally Suitable\",IF(O19=2,\"Moderately Suitable\",\"Highly Suitable\")))","v":"Highly Suitable"},null,"Precipitation",{"$f":"IF(P16=\"Moderately Suitable\",2,IF(P16=\"Marginally Suitable\",1,3))","v":3}]
[null,null,"J","F","M","A","M","J","J","A","S","O","N","D"]
[]
[null,"Monthly average temperature (°C)",25,26,26,26,25,23,22,23,24,25,25,25,{"$f":"COUNTIF(C21:N21,\"Arid\")","v":3},null,null,"Tavg",{"$f":"AVERAGE(C19:N19)","v":24.583333333333332}]
[null,"Monthly average precipitation (mm)",30,26,60,130,90,37,30,30,28,57,90,50,null,null,null,"Pavg",{"$f":"AVERAGE(C20:N20)","v":54.833333333333336}]
{"$rows_left_out":13}
{"sheet":"INPUT_Weight setting","index":2,"n_rows":41,"n_cols":9,"rows_kept":41,"cut":false,"hidden":false,"merged":[[11,1,11,5],[10,1,10,5],[4,5,6,5],[3,0,3,5]]}
[]
[null,null,null,"INPUT - Weight Setting"]
[]
[]
[]
[null,"Geophysical  Parameters:"]
[null,"Non-critical Geophysical Parameters"]
[null,"Additional parameters that are key to the market assessment for SPIS. These do not affect the general viability of SPIS; they affect the success of SPIS adoption in a region as per prevailing geophysical conditions (e.g. groundwater table, frost occurence, topography, agricultural production farming system, etc.). "]
[null,"Inconsequential"]
[null,{"$f":"H40","v":9.0909090909090912E-2}]
[]
[null,"Business Conditions:"]
[null,"1. Government Interventions",null,"2. Development Organizations Interventions",null,"3. Financing"]
[null,"Evaluation of government interventions as a business environment parameter for SPIS, looking at policies, rules and regulations that govern the irrigation and solar sectors. ",null,"This section evaluates  interventions by development organizations that can present a significant influence on the adoption of SPIS within a country or region. ",null,"The parameter looks at the ability of end users to meet the high capital cost for SPIS including financial support from government, development agencies and private sector."]
[null,"Slightly important",null,"Inconsequential",null,"Inconsequential"]
[null,{"$f":"H31","v":0.18181818181818182},null,{"$f":"H32","v":9.0909090909090912E-2},null,{"$f":"H33","v":9.0909090909090912E-2}]
[]
[null,"4. Availability and Cost of Alternatives",null,"5. Technical Capacity",null,"6. Awareness of SPIS Technologies"]
[null,"Criterion considers the availability and cost of competing sources of power for irrigation systems. ",null,"This section evaluates the in country capacity of personnel to design, implememt and maintain SPIS systems.",null,"Parameter assesses the general awareness of solar technologies such as solar lighting and heating systems, and irrigation systems such as pumps in the country."]
[null,"Inconsequential",null,"Inconsequential",null,"Inconsequential"]
{"$rows_left_out":22}
{"sheet":" INPUT_Geophysical Parameters","index":3,"n_rows":17,"n_cols":10,"rows_kept":17,"cut":false,"hidden":false,"merged":[[1,2,1,3],[7,2,7,3],[8,2,8,3],[9,2,9,3],[4,0,5,0],[6,2,6,3],[4,1,5,3],[3,0,3,5],[13,2,13,3],[14,2,14,3],[15,2,15,3],[16,2,16,3],[11,1,11,5]]}
[]
[null,null,"INPUT - Geophysical Parameters"]
[]
[]
[2,"Additional Geophysical Parameters",null,null,"Highest Possible Score","Attained Score"]
[{"$nulls":4},{"$f":"'INPUT_Weight setting'!B10","v":9.0909090909090912E-2},{"$f":"SUM(I8:I11)","v":7.2727272727272738E-2}]
[null,"Questions","Sample Data Sources",null,"Answer","Relevance",null,"Weight","Attained Score","Raw Score"]
["a)",{"$f":"\"What is the average ground water table in \"&'INPUT_Pre-check'!D6&\" earmarked for SPIS?\"","v":"What is the average ground water table in  Kenya earmarked for SPIS?"},"Estimated depth of groundwater resources",null,"25m - 50m","Inconsequential",null,{"$f":"E6/COUNTA(B8,B9,B10,B11)","v":2.2727272727272728E-2},{"$f":"(J8*H8)","v":1.3636363636363636E-2},{"$f":"IF(E8=\"Up to 7m\",1,IF(E8=\"7m - 25m\",0.8,IF(E8=\"25m - 50m\",0.6,IF(E8=\"50m - 100m\",0.1,IF(E8=\"Beyond 100m\",0,IF(E8=\"Unknown\",0))))))*IF(F8=\"Inconsequential\",6,IF(F8=\"Slightly important\",5,IF(F8=\"Important\",4,IF(F8=\"Very important\",3,IF(F8=\"Critical\",2)))))/6","v":0.6}]
["b)",{"$f":"\"What is \"&'INPUT_Pre-check'!D6&\"'s minimum annual ambient temperature in terms of frost occurences?\"","v":"What is  Kenya's minimum annual ambient temperature in terms of frost occurences?"},"World Bank Global Temperature Data",null,"1C to 30C","Inconsequential",null,{"$f":"(E6/COUNTA(B8,B9,B10,B11))","v":2.2727272727272728E-2},{"$f":"(J9*H9)","v":2.2727272727272728E-2},{"$f":"IF(E9=\"1C to 30C\",(IF(F9=\"Inconsequential\",6,IF(F9=\"Slightly important\",5,IF(F9=\"Important\",4,IF(F9=\"Very important\",3,IF(F9=\"Critical\",2)))))),(IF(F9=\"Inconsequential\",6,IF(F9=\"Slightly important\",4,IF(F9=\"Important\",2,IF(F9=\"Very important\",1,IF(F9=\"Critical\",0)))))))/6","v":1}]
["c)",{"$f":"\"What is \"&'INPUT_Pre-check'!D6&\"'s general topography regarded as?\"","v":"What is  Kenya's general topography regarded as?"},"What is the slope of the area?",null,"Moderate","Inconsequential",null,{"$f":"(E6/COUNTA(B8,B9,B10,B11))","v":2.2727272727272728E-2},{"$f":"(J10*H10)","v":1.8181818181818184E-2},{"$f":"IF(E10=\"Flat\",1,IF(E10=\"Moderate\",0.8,IF(E10=\"Steep\",0.6)))*IF(F10=\"Inconsequential\",6,IF(F10=\"Slightly important\",5,IF(F10=\"Important\",4,IF(F10=\"Very important\",3,IF(F10=\"Critical\",2)))))/6","v":0.80000000000000016}]
["d)",{"$f":"\"What is the main type of agricultural production in \"&'INPUT_Pre-check'!D6&\"'s farming system?\"","v":"What is the main type of agricultural production in  Kenya's farming system?"},"Global Agro-Ecological Zones","Farming Systems Maps FAO","Perennial Crops","Inconsequential",null,{"$f":"(E6/COUNTA(B8,B9,B10,B11))","v":2.2727272727272728E-2},{"$f":"(J11*H11)","v":1.8181818181818184E-2},{"$f":"IF(E11=\"Seasonal Crops\",0.6,IF(E11=\"Perennial Crops\",0.8,IF(E11=\"Small Livestock\",0.95,IF(E11=\"Large Livestock\",0.9,IF(E11=\"Seasonal and Perennial Crops\",0.7,IF(E11=\"Livestock and crops\",0.7))))))*IF(F11=\"Inconsequential\",6,IF(F11=\"Slightly important\",5,IF(F11=\"Important\",4,IF(F11=\"Very important\",3,IF(F11=\"Critical\",2)))))/6","v":0.80000000000000016}]
[null,{"$f":"IF((Calculations!G4)<(50 %), \"Your score is below 50 % of your initial values for Geophysical Parameters! Please revise your weight setting!\", \"\")","v":""}]
[]
[null,null,"Got more recent data sources? "]
[null,null,"PLEASE SHARE "]
[null,null," and help us to improve our tools."]
[null,null,"Thank you."]

{"sheet":"INPUT_Business Conditions","index":4,"n_rows":108,"n_cols":10,"rows_kept":108,"cut":false,"hidden":false,"merged":[[83,9,85,9],[39,7,43,7],[39,8,43,8],[39,9,43,9],[7,7,9,7],[7,8,9,8],[7,9,9,9],[1,2,1,3],[13,0,14,0],[13,1,14,3],[14,7,14,9],[4,0,5,0],[4,1,5,3],[5,7,5,9],[6,2,6,3],[10,2,10,3],[7,1,9,1],[7,5,9,5],[7,0,9,0],[7,2,9,2],[7,4,9,4],[3,0,3,5],[104,2,104,3],[105,2,105,3],[106,2,106,3],[107,2,107,3],[15,2,15,3],[17,1,18,1],[17,4,19,4],[66,1,66,5],[62,1,62,5],[63,2,63,3],[64,2,64,3],[65,2,65,3],[61,2,61,3],[59,1,60,3],[57,2,57,3],[99,2,101,3],[81,2,81,3],[82,2,82,3],[84,5,85,5],[84,4,85,4],[86,4,87,4],[21,1,22,3],[17,5,19,5],[28,3,29,3],[97,2,97,3],[59,0,60,0],[17,8,19,8],[17,9,19,9],[19,2,19,3],[21,0,22,0],[17,7,19,7],[17,0,18,0],[52,0,53,0],[34,0,35,0],[23,2,23,3],[39,0,43,0],[39,5,43,5],[38,2,38,3],[39,1,43,1],[43,2,43,3],[39,3,40,3],[39,4,43,4],[28,2,29,2],[86,7,87,7],[86,8,87,8],[86,9,87,9],[83,7,85,7],[83,8,85,8],[98,1,98,5],[84,1,85,1],[84,0,85,0],[84,3,87,3],[85,2,86,2],[86,1,87,1],[86,0,87,0],[79,0,80,0],[70,0,71,0],[70,1,71,3],[72,2,72,3],[73,2,73,3],[74,2,74,3],[75,2,75,3],[76,2,76,3],[77,2,77,3],[79,1,80,3],[86,5,87,5],[89,1,90,3],[91,2,91,3],[83,3,83,5],[89,0,90,0],[92,1,92,5],[93,2,96,3],[102,1,102,5],[88,1,88,5],[69,1,69,5],[58,1,58,5],[51,1,51,5],[33,1,33,5],[20,1,20,5],[12,1,12,5],[78,1,78,5],[45,1,45,5],[24,1,24,5],[25,2,25,3],[26,2,26,3],[27,1,27,5],[30,1,30,5],[31,2,31,3],[32,2,32,3],[56,2,56,3],[55,2,55,3],[54,2,54,3],[52,1,53,3],[48,1,48,5],[37,1,37,5],[34,1,35,3]]}
[]
[null,null,"INPUT - Business Conditions Parameters"]
[]
[]
[1,"Government interventions",null,null,"Highest Possible Score ","Attained Score"]
[{"$nulls":4},{"$f":"'INPUT_Weight setting'!B16","v":0.18181818181818182},{"$f":" IF(OR(AND(E8=\"No\",F8=\"Critical\"),AND(E11=\"No\",F11=\"Critical\"),AND(E12=\"No\",F12=\"Critical\")),0,SUM(I8:I12))","v":7.0707070707070704E-2}]
[null,"Questions","Sample Data Sources",null,"Answer","Relevance",null,"Weight","Attained score","Raw Score"]
["a)",{"$f":" \"Are there\" &'INPUT_Pre-check'!D6&\" government, national and local policies and laws promoting solar and irrigation equipment?\"","v":"Are there Kenya government, national and local policies and laws promoting solar and irrigation equipment?"},"• Government irrigation and or solar policies, laws, bills, acts, sector development plans\n• Licensing of solar technicians, suppliers and  or contractor companies\n• Government tax regulation such as duty and VAT exemptions\n","Clean energy development policies","No","Important",null,{"$f":"E6/COUNTA(B8:B12)","v":6.0606060606060608E-2},{"$f":"(J8*H8)","v":1.01010101010101E-2},{"$f":"(IF(E8=\"Yes\",(IF(F8=\"Inconsequential\",3,IF(F8=\"Slightly important\",4,IF(F8=\"Important\",4,IF(F8=\"Very important\",5,IF(F8=\"Critical\",6)))))),(IF(F8=\"Inconsequential\",3,IF(F8=\"Slightly important\",2,IF(F8=\"Important\",1,IF(F8=\"Very important\",1,IF(F8=\"Critical\",0))))))))/6","v":0.16666666666666666}]
[null,null,null,"Renewable energy support policies in developing countries: Table 4, Pg. 121 "]
[null,null,null,"Asia pacific countries policy documents"]
["b)",{"$f":"\"Are there in\"&'INPUT_Pre-check'!D6&\" government programs promoting SPIS devices?\"","v":"Are there in Kenya government programs promoting SPIS devices?"},"• Irrigation and solar programs supported by government resources",null,"Unknown","Inconsequential",null,{"$f":"E6/COUNTA(B8:B12)","v":6.0606060606060608E-2},{"$f":"(J11*H11)","v":3.0303030303030304E-2},{"$f":"(IF(E11=\"Yes\",(IF(F11=\"Inconsequential\",3,IF(F11=\"Slightly important\",4,IF(F11=\"Important\",4,IF(F11=\"Very important\",5,IF(F11=\"Critical\",6)))))),(IF(F11=\"Inconsequential\",3,IF(F11=\"Slightly important\",2,IF(F11=\"Important\",1,IF(F11=\"Very important\",1,IF(F11=\"Critical\",0))))))))/6","v":0.5}]
["c)",{"$f":"\"Are there relevant\"&'INPUT_Pre-check'!D6&\" government ministries and/bodies providing support to the sector?\"","v":"Are there relevant Kenya government ministries and/bodies providing support to the sector?"},"• Agriculture and energy ministries with engagement in SPIS sector\n• Government irrigation organizations, boards, groups\n• Government organizations providing SPIS related information\n• Government quality and standards regulation and enforcement","Stand alone systems regulations and incentives","Unknown","Inconsequential",null,{"$f":"E6/COUNTA(B8:B12)","v":6.0606060606060608E-2},{"$f":"(J12*H12)","v":3.0303030303030304E-2},{"$f":"(IF(E12=\"Yes\",(IF(F12=\"Inconsequential\",3,IF(F12=\"Slightly important\",4,IF(F12=\"Important\",4,IF(F12=\"Very important\",5,IF(F12=\"Critical\",6)))))),(IF(F12=\"Inconsequential\",3,IF(F12=\"Slightly important\",2,IF(F12=\"Important\",1,IF(F12=\"Very important\",1,IF(F12=\"Critical\",0))))))))/6","v":0.5}]
[]
[2,"Development Organizations Interventions",null,null,"Highest Possible Score","Attained Score"]
[{"$nulls":4},{"$f":"'INPUT_Weight setting'!D16","v":9.0909090909090912E-2},{"$f":" IF(OR(AND(E17=\"No\",F17=\"Critical\"),AND(E18=\"No\",F18=\"Critical\")),0,SUM(I17:I20))","v":9.0909090909090912E-2}]
[null,"Questions","Sample Data Sources",null,"Answer","Relevance",null,"Weight","Attained score","Raw Score"]
["a)",{"$f":"\"Are there national programs provided in\"&'INPUT_Pre-check'!D6&\" by non - government institutions that promote adoption of irrigation?\"","v":"Are there national programs provided in Kenya by non - government institutions that promote adoption of irrigation?"},"• List of possible* development agencies and multilateral organizations: ","GIZ (Deutsche Gesellschaft für Internationale Zusammenarbeit GmbH)","Yes","Critical",null,{"$f":"E15/(COUNTA(B17:B20))","v":4.5454545454545456E-2},{"$f":"(J17*H17)","v":4.5454545454545456E-2},{"$f":"(IF(E17=\"Yes\",(IF(F17=\"Inconsequential\",3,IF(F17=\"Slightly important\",4,IF(F17=\"Important\",4,IF(F17=\"Very important\",5,IF(F17=\"Critical\",6)))))),(IF(F17=\"Inconsequential\",3,IF(F17=\"Slightly important\",2,IF(F17=\"Important\",1,IF(F17=\"Very important\",1,IF(F17=\"Critical\",0))))))))/6","v":1}]
["b)",{"$f":"\"Are there national programs provided in\"&'INPUT_Pre-check'!D6&\" by non-government institutions specifically promoting adoption of SPIS devices?\"","v":"Are there national programs provided in Kenya by non-government institutions specifically promoting adoption of SPIS devices?"},"• List of possible* facilities and funds:","GEF (Global Environment Facility)","Yes","Critical",null,{"$f":"E15/COUNTA(B17:B20)","v":4.5454545454545456E-2},{"$f":"(J18*H18)","v":4.5454545454545456E-2},{"$f":"(IF(E18=\"Yes\",(IF(F18=\"Inconsequential\",3,IF(F18=\"Slightly important\",4,IF(F18=\"Important\",4,IF(F18=\"Very important\",5,IF(F18=\"Critical\",6)))))),(IF(F18=\"Inconsequential\",3,IF(F18=\"Slightly important\",2,IF(F18=\"Important\",1,IF(F18=\"Very important\",1,IF(F18=\"Critical\",0))))))))/6","v":1}]
[null,null,"• List of possible* research centers and other NGOs:","AGRA"]
[null,null,"* List is not exhaustive"]
{"$rows_left_out":89}
{"sheet":"OUTPUT_Result","index":5,"n_rows":32,"n_cols":9,"rows_kept":32,"cut":false,"hidden":false,"merged":[[1,3,1,8],[18,1,18,11],[3,2,3,3],[4,2,4,3],[3,6,3,7],[3,8,3,9],[4,6,4,7],[4,8,4,10],[5,1,5,4],[5,7,5,11]]}
[]
[null,null,null,"OUTPUT - Results"]
[]
[null,"Country:",{"$f":"'INPUT_Pre-check'!D6","v":" Kenya"},null,null,null,"Assessment date:",null,{"$f":"'INPUT_Pre-check'!D8","v":"00:00:00"}]
[null,"Specific area of interest:",{"$f":"'INPUT_Pre-check'!D7","v":0},null,null,null,"Assessor name:",null,{"$f":"'INPUT_Pre-check'!D9","v":0}]
[null,"Total Score (%)",{"$nulls":5},"Overview of Relevance Ratings"]
{"$rows_empty":12}
[null,"B. Market Potential for SPIS: Overall Score"]
{"$rows_empty":9}
[null,"Low Market Potential"]
[null,"Marginal Market Potential"]
[null,"Moderate Market Potential"]
[null,"High Market Potential"]

{"sheet":"Calculations","index":6,"n_rows":36,"n_cols":7,"rows_kept":36,"cut":false,"hidden":true,"merged":[]}
[]
[]
[null,"Enabling SPIS Business Factors","Initial weight setting","Actually attained score ","Difference ",null,"Attained Score"]
[1,"Geophysical Parameters",{"$f":"' INPUT_Geophysical Parameters'!E6","v":9.0909090909090912E-2},{"$f":"' INPUT_Geophysical Parameters'!F6","v":7.2727272727272738E-2},{"$f":"C4-D4","v":1.8181818181818174E-2},{"$f":"100%-C4","v":0.90909090909090906},{"$f":"D4/C4","v":0.8}]
[2,"Government interventions",{"$f":"'INPUT_Business Conditions'!E6","v":0.18181818181818182},{"$f":"'INPUT_Business Conditions'!F6","v":7.0707070707070704E-2},{"$f":"C5-D5","v":0.11111111111111112},{"$f":"100%-C5","v":0.81818181818181812},{"$f":"D5/C5","v":0.38888888888888884}]
[3,"Development Organizations Interventions",{"$f":"'INPUT_Business Conditions'!E15","v":9.0909090909090912E-2},{"$f":"'INPUT_Business Conditions'!F15","v":9.0909090909090912E-2},{"$f":"C6-D6","v":0},{"$f":"100%-C6","v":0.90909090909090906},1]
[4,"Financing",{"$f":"'INPUT_Business Conditions'!E23","v":9.0909090909090912E-2},{"$f":"'INPUT_Business Conditions'!F23","v":4.5454545454545456E-2},4.5454545454545456E-2,0.90909090909090906,0.5]
[5,"Availability  and cost of alternative sources of power for pumping",{"$f":"'INPUT_Business Conditions'!E36","v":9.0909090909090912E-2},{"$f":"'INPUT_Business Conditions'!F36","v":5.6818181818181823E-2},3.4090909090909088E-2,0.90909090909090906,0.625]
[6,"Technical capacity for SPIS",{"$f":"'INPUT_Business Conditions'!E54","v":9.0909090909090912E-2},{"$f":"'INPUT_Business Conditions'!F54","v":4.5454545454545456E-2},4.5454545454545456E-2,0.90909090909090906,0.5]
[7,"Awareness of solar PV and irrigation technologies ",{"$f":"'INPUT_Business Conditions'!E61","v":9.0909090909090912E-2},{"$f":"'INPUT_Business Conditions'!F61","v":4.5454545454545456E-2},4.5454545454545456E-2,0.90909090909090906,0.5]
[8,"Significance of agriculture in the local economy",{"$f":"'INPUT_Business Conditions'!E72","v":9.0909090909090912E-2},{"$f":"'INPUT_Business Conditions'!F72","v":4.5454545454545456E-2},4.5454545454545456E-2,0.90909090909090906,0.5]
[9,"Land use rights, ownership and tenure ",{"$f":"'INPUT_Business Conditions'!E81","v":9.0909090909090912E-2},{"$f":"'INPUT_Business Conditions'!F81","v":4.5454545454545456E-2},4.5454545454545456E-2,0.90909090909090906,0.5]
[10,"Transportation and communication infrastructure ",{"$f":"'INPUT_Business Conditions'!E91","v":9.0909090909090912E-2},{"$f":"'INPUT_Business Conditions'!F91","v":4.5454545454545456E-2},4.5454545454545456E-2,0.90909090909090906,0.5]
[null,null,{"$f":"SUM(C4:C13)","v":1.0000000000000002},{"$f":"SUM(D4:D13)","v":0.56388888888888888},{"$f":"C14-D14","v":0.43611111111111134}]
[]
[]
[]
[]
[]
[]
{"$rows_left_out":17}
{"sheet":"Lists","index":7,"n_rows":241,"n_cols":7,"rows_kept":241,"cut":false,"hidden":true,"merged":[]}
["Countries","Development Agencies","Facilitites and Funds","Other NGOs, Foundations","Rural MPI","GNI per Capita","pump manufacturers"]
["Afghanistan","African Development Bank","CTF (Clean Technology Fund)","AAA (Adaptation of African Agriculture)","0.10 - 1.86","Low income ($1,005 or less)","AllightSykes"]
[" Albania","CGIAR (Climate Change, Agriculture and Food Security)","EcoMicro","AGRA","1.87 - 8.80","Lower Middle Income ($1,006 to $3,955)","Ebara"]
[" Algeria","DFID ( Department for International Development - United Kingdom)","GEF (Global Environment Facility)","Energy 4Impact","8.81 - 26.06","Upper Middle Income ($3,956 tp $12,235)","Flowserve"]
[" American Samoa","FAO (Food and Agriculture Organization) ","GPOBA (Global Partnershi on Output Based Aid)","IFPRI (International Food Policy Research Institute)","26.07 - 48.54","High Income ($12.236 or more)","Grundfos"]
[" Andorra","GACSA (Global Alliance For Climate-Smart Agriculture)","ICBA","Lutheran World Relief","48.55 - 68.29",null,"Kirloskar Brothers Lt"]
[" Angola","GIZ (Deutsche Gesellschaft für Internationale Zusammenarbeit GmbH)","ICBA (International Center for Biosaline Agriculture)","The Practica Foundation","68.30 - 84.33",null,"KSB"]
[" Anguilla","IFAD (International Fund for Agriculture Development)",null,null,"84.34 - 96.90",null,"Lorentz"]
[" Antarctica","JICA (Japan International Cooperation Agency)",null,null,"No data",null,"Ruhrpumpen Group"]
[" Antigua and Barbuda","Nordic Development Fund",{"$nulls":4},"Suzler Ltd"]
[" Argentina","OECD (Organisation for Economic Co-operation and Development)",{"$nulls":4},"Weir Group"]
[" Armenia","OFID (OPEC Fund for International Development)",{"$nulls":4},"Wilo SE"]
[" Aruba","SIDA (Swedish International Development Cooperation Agency)",{"$nulls":4},"Xylem"]
[" Australia","USAID"]
[" Austria","World Bank Group"]
[" Azerbaijan","World Food Programme"]
[" Bahamas"]
[" Bahrain"]
[" Bangladesh"]
[" Barbados"]
{"$rows_left_out":222}
{"sheet":"Lists 2","index":8,"n_rows":241,"n_cols":16,"rows_kept":241,"cut":false,"hidden":true,"merged":[]}
["Column1","Column2","Column3","Column4","Column1",null,null,"Solar Ranges",null,"Groundwater Depth",null,"Topography",null,"Ambient temperature",null,"Population Density"]
["Cropland, rainfed","Highly Suitable",null,null," Afghanistan",null,null,"0 - 948",null,"Up to 7m",null,"Mountainous",null,"Below 1C",null,"<1"]
["Cropland irrigated or post-flooding","Highly Suitable",null,null," Albania",null,null,"949 - 1094",null,"7m - 25m",null,"Steep hills",null,"1C to 30C",null,"1 - 5"]
["Mosaic crop land with natural vegetation","Highly Suitable",null,null," Algeria",null,null,"1095 - 1460",null,"25m - 50m",null,"Rolling hills",null,null,null,"5 - 25"]
["Light forest (tree cover up to 40%)","Moderately Suitable",null,null," American Samoa",null,null,"Above 1460",null,"50m - 100m",null,"Level",null,null,null,"25 - 250"]
["Dense forest (tree cover above 40%)","Moderately Suitable",null,null," Andorra",{"$nulls":4},"Beyond 100m",null,"Mixed various",null,null,null,"250 - 1000"]
["Shrubland","Marginally Suitable",null,null," Angola",{"$nulls":4},"Unknown",{"$nulls":5},">1000"]
["Grassland","Moderately Suitable",null,null," Anguilla"]
["Lichens and mosses","Marginally Suitable",null,null," Antarctica"]
["Semi arid sparse vegetation","Marginally Suitable",null,null," Antigua and Barbuda"]
["Flood plains fresh water","Marginally Suitable",null,null," Argentina"]
["Flood plains brackish water","Not Suitable",null,null," Armenia"]
["Urban areas","Not Suitable",null,null," Aruba"]
["Bare areas","Marginally Suitable",null,null," Australia"]
["Water bodies","Not Suitable",null,null," Austria"]
["Permanent snow and ice","Not Suitable",null,null," Azerbaijan"]
[{"$nulls":4}," Bahamas"]
[{"$nulls":4}," Bahrain"]
[{"$nulls":4}," Bangladesh"]
[{"$nulls":4}," Barbados"]
{"$rows_left_out":221}