{"text_format":"1","workbook":"xlsx","n_sheets":7,"sheets":["READ ME","1 INPUT-Checklist","2 INPUT-Data","3 OUTPUT-Graphs","Translate","VERSION CONTROL","Reference"],"not_rendered":{"charts":4,"images":8,"macros":1,"external_links":0,"defined_names":2,"comments":1,"pivot_tables":0},"unopened":[],"bounds":{"document_bytes":16777216,"sheet_cells":100000,"rows_first":2000,"rows_last":500,"rows_between":2000,"halvings":0,"cell_chars":16384,"cell_head_chars":4096},"cells_cut":0,"cells_raw":0,"read":"whole","date_system":"1900"}

{"sheet":"READ ME","index":0,"n_rows":81,"n_cols":7,"rows_kept":81,"cut":false,"hidden":false,"merged":[[33,3,33,8],[45,5,45,8],[10,3,10,5],[10,6,10,7],[26,3,26,8],[27,3,27,8],[28,3,28,8],[12,3,12,8],[17,3,17,8],[19,3,19,8],[25,3,25,8],[32,3,32,8],[20,3,23,8],[29,3,29,8],[30,3,30,8],[31,3,31,8],[46,3,47,4],[46,5,47,8],[35,3,37,5],[35,6,37,8],[38,3,40,5],[38,6,40,8],[41,3,42,5],[41,6,42,8],[44,3,44,8],[45,3,45,4],[80,3,80,5],[48,3,48,4],[48,5,48,7],[49,3,49,4],[49,5,49,8],[50,3,52,4],[50,5,51,8],[52,5,52,7],[53,3,53,4],[53,5,53,7],[55,3,62,8],[64,3,72,8],[74,3,78,8]]}
[]
[]
[]
[]
[]
[]
[]
[]
[]
[]
[null,null,null,{"$f":"Translate!$C$18","v":"Select language"},null,null,"English"]
[]
[null,null,null,{"$f":"Translate!$C$19","v":"Read Me Sheet"}]
[]
[]
[]
[]
[null,null,null,{"$f":"Translate!$C$20","v":"PROMOTE and INITIATE – Impact Assessment Tool"}]
[]
[null,null,null,{"$f":"Translate!$C$21","v":"Introduction"}]
{"$rows_left_out":62}
{"sheet":"1 INPUT-Checklist","index":1,"n_rows":92,"n_cols":8,"rows_kept":92,"cut":false,"hidden":false,"merged":[[59,1,59,2],[91,1,91,2],[88,1,88,2],[89,1,89,2],[60,1,60,2],[61,1,61,2],[63,1,63,2],[62,1,62,6],[76,1,76,2],[77,1,77,2],[78,1,78,2],[79,1,79,2],[80,1,80,2],[71,1,71,2],[72,1,72,2],[75,1,75,2],[86,1,86,2],[87,1,87,2],[64,1,64,2],[65,1,65,2],[66,1,66,2],[67,1,67,2],[69,1,69,2],[81,1,81,2],[82,1,82,2],[68,1,68,6],[85,1,85,2],[83,1,83,2],[53,1,53,2],[54,1,54,2],[55,1,55,2],[56,1,56,2],[57,1,57,2],[58,1,58,2],[70,1,70,2],[73,1,73,2],[74,1,74,2],[30,1,30,2],[52,1,52,6],[44,1,44,6],[32,1,32,2],[33,1,33,2],[34,1,34,2],[35,1,35,2],[36,1,36,2],[38,1,38,2],[39,1,39,2],[45,1,45,2],[46,1,46,2],[1,0,1,6],[0,1,0,6],[47,1,47,2],[16,1,16,2],[8,4,8,5],[9,4,9,5],[5,4,5,5],[6,4,6,5],[3,4,3,5],[4,4,4,5],[31,1,31,2],[14,1,14,6],[15,1,15,2],[17,1,17,2],[24,1,24,2],[40,1,40,2],[29,1,29,2],[2,0,2,6],[7,4,7,5],[19,1,19,2],[20,1,20,2],[25,1,25,2],[26,1,26,2],[23,1,23,2],[22,5,22,6],[27,1,27,2],[28,1,28,2],[18,1,18,2],[21,1,21,2],[22,2,22,4],[48,1,48,2],[49,1,49,2],[50,1,50,2],[51,1,51,2],[37,1,37,6],[42,1,42,2],[41,1,41,2],[43,1,43,2]]}
[null,{"$f":"Translate!C50","v":"PROMOTE and INITIATE – Impact Assessment Tool"}]
[{"$f":"Translate!$C$51","v":"SOCIO-ECONOMIC AND ENVIRONMENTAL IMPACTS"}]
[{"$f":"Translate!$C$52","v":"This checklist is to roughly assess the socio-economic and environmental impacts of solar-powered irrigation systems. "}]
[null,1,{"$f":"B15","v":"Population Change and Migration"},{"$f":"SUMIF($D$16:$D$22,\"<>Reference!$A$16\",$H$16:$H$22)","v":52.5},{"$f":"Translate!$C$61","v":"Project Name:"},null,"sample"]
[null,2,{"$f":"B23","v":"Women's Role"},{"$f":"SUMIF($D$24:$D$37,\"<>Reference!$A$16\",$H$24:$H$37)","v":105},{"$f":"Translate!$C$62","v":"Project Location:"}]
[null,3,{"$f":"B38","v":"Minority and Indigene Groups"},{"$f":"SUMIF($D$39:$D$44,\"<>Reference!$A$16\",$H$39:$H$44)","v":45},{"$f":"Translate!$C$63","v":"User Name:"}]
[null,4,{"$f":"B45","v":"Income and Amenities"},{"$f":"SUMIF($D$46:$D$52,\"<>Reference!$A$16\",$H$46:$H$52)","v":52.5},{"$f":"Translate!$C$64","v":"Date of Impact Assessment:"}]
[null,5,{"$f":"B53","v":"Regional Effects in Country"},{"$f":"SUMIF($D$54:$D$62,\"<>Reference!$A$16\",$H$54:$H$62)","v":67.5},{"$f":"Translate!$C$65","v":"Project Duration (years):"}]
[null,6,{"$f":"B63","v":"User Involvement"},{"$f":"SUMIF($D$64:$D$68,\"<>Reference!$A$16\",$H$64:$H$68)","v":37.5},{"$f":"Translate!$C$66","v":"Asset Lifespan (years):"}]
[null,7,{"$f":"B69","v":"Natural Resources and Environment"},{"$f":"SUMIF($D$70:$D$92,\"<>Reference!$A$16\",$H$70:$H$92)","v":172.5},{"$f":"Translate!$C$67","v":"Notes:"}]
[null,null,{"$f":"Translate!C60","v":"SCORE"},{"$f":"SUM(D4+D7+D5+D6+D10+D8+D9)","v":532.5}]
[]
[]
[{"$f":"Translate!$C$68","v":"Ref #"},{"$f":"Translate!$C$69","v":"Question"},null,{"$f":"Translate!$C$70","v":"Yes, No or N/A "},{"$f":"Translate!$C$71","v":"Weighting \n(how important is this to the project?)"},{"$f":"Translate!$C$72","v":"What is the impact of the project?"},{"$f":"Translate!$C$73","v":"Comments"}]
[1,{"$f":"Translate!$C$53","v":"Population Change and Migration"}]
["1a",{"$f":"Translate!$C$74","v":"Have changes to population size/density and demographic/ethnic composition been considered in the planning of the Project? "},null,"Yes","High","Positive impact is very likely",null,{"$f":"IFERROR(IF(D16=Reference!$A$16,Reference!$A$16,IF(D16=Reference!$A$14,(VLOOKUP(E16,Reference!$A$9:$B$11,2,FALSE)*VLOOKUP(F16,Reference!$A$2:$B$7,2,FALSE)*VLOOKUP(D16,Reference!$A$14:$B$15,2,FALSE)),(VLOOKUP(E16,Reference!$A$9:$B$11,2,FALSE)*VLOOKUP(F16,Reference!$A$2:$C$7,3,FALSE)*VLOOKUP(D16,Reference!$A$14:$B$15,2,FALSE)))),\" \")","v":7.5}]
["1b",{"$f":"Translate!$C$75","v":"Is the project causing significant demographic changes in the project area or vicinity which may affect social harmony? "},null,"Yes","High","Positive impact is very likely",null,{"$f":"IFERROR(IF(D17=Reference!$A$16,Reference!$A$16,IF(D17=Reference!$A$14,(VLOOKUP(E17,Reference!$A$9:$B$11,2,FALSE)*VLOOKUP(F17,Reference!$A$2:$B$7,2,FALSE)*VLOOKUP(D17,Reference!$A$14:$B$15,2,FALSE)),(VLOOKUP(E17,Reference!$A$9:$B$11,2,FALSE)*VLOOKUP(F17,Reference!$A$2:$C$7,3,FALSE)*VLOOKUP(D17,Reference!$A$14:$B$15,2,FALSE)))),\" \")","v":7.5}]
["1c",{"$f":"Translate!$C$76","v":"Is the project avoiding the physical and economic displacement of people?"},null,"Yes","High","Positive impact is very likely",null,{"$f":"IFERROR(IF(D18=Reference!$A$16,Reference!$A$16,IF(D18=Reference!$A$14,(VLOOKUP(E18,Reference!$A$9:$B$11,2,FALSE)*VLOOKUP(F18,Reference!$A$2:$B$7,2,FALSE)*VLOOKUP(D18,Reference!$A$14:$B$15,2,FALSE)),(VLOOKUP(E18,Reference!$A$9:$B$11,2,FALSE)*VLOOKUP(F18,Reference!$A$2:$C$7,3,FALSE)*VLOOKUP(D18,Reference!$A$14:$B$15,2,FALSE)))),\" \")","v":7.5}]
["1d",{"$f":"Translate!$C$77","v":"Has human migration, away form the Project location (e.g. rural flight) and toward it (e.g. demand for (seasonal) agricultural labour), been considered?"},null,"Yes","High","Positive impact is very likely",null,{"$f":"IFERROR(IF(D19=Reference!$A$16,Reference!$A$16,IF(D19=Reference!$A$14,(VLOOKUP(E19,Reference!$A$9:$B$11,2,FALSE)*VLOOKUP(F19,Reference!$A$2:$B$7,2,FALSE)*VLOOKUP(D19,Reference!$A$14:$B$15,2,FALSE)),(VLOOKUP(E19,Reference!$A$9:$B$11,2,FALSE)*VLOOKUP(F19,Reference!$A$2:$C$7,3,FALSE)*VLOOKUP(D19,Reference!$A$14:$B$15,2,FALSE)))),\" \")","v":7.5}]
["1e",{"$f":"Translate!$C$78","v":"Does the project ensure decent rural employment, promoting more and better employment opportunities and working conditions and avoiding practices that could increase workers’ vulnerability?"},null,"Yes","High","Positive impact is very likely",null,{"$f":"IFERROR(IF(D20=Reference!$A$16,Reference!$A$16,IF(D20=Reference!$A$14,(VLOOKUP(E20,Reference!$A$9:$B$11,2,FALSE)*VLOOKUP(F20,Reference!$A$2:$B$7,2,FALSE)*VLOOKUP(D20,Reference!$A$14:$B$15,2,FALSE)),(VLOOKUP(E20,Reference!$A$9:$B$11,2,FALSE)*VLOOKUP(F20,Reference!$A$2:$C$7,3,FALSE)*VLOOKUP(D20,Reference!$A$14:$B$15,2,FALSE)))),\" \")","v":7.5}]
{"$rows_left_out":73}
{"sheet":"2 INPUT-Data","index":2,"n_rows":45,"n_cols":6,"rows_kept":45,"cut":false,"hidden":false,"merged":[[39,1,39,5],[0,0,0,5],[1,0,1,5],[7,1,7,5],[19,1,19,5],[25,1,25,5]]}
[{"$f":"Translate!$C$158","v":"PROMOTE and INITIATE – Impact Assessment Tool"}]
[{"$f":"Translate!$C$159","v":"SOCIO-ECONOMIC DATA"}]
[{"$f":"Translate!$C$160","v":"Ref #"},{"$f":"Translate!$C$161","v":"Question"},{"$f":"Translate!$C$162","v":"ABSOLUTE NUMBER"},{"$f":"Translate!$C$163","v":"PERCENTAGE [%]"},{"$f":"Translate!$C$164","v":"USER COMMENTS"},{"$f":"Translate!$C$165","v":"PROJECT REVIEWER COMMENTS"}]
["A1.0",{"$f":"Translate!$C$166","v":"What is the population in the vicinity of the project?\n"}]
["A1.1",{"$f":"Translate!$C$167","v":"How many will be impacted by the project?\n"},null,{"$f":"IFERROR(C5/C4,\"-\")","v":"-"}]
["A1.2",{"$f":"Translate!$C$168","v":"How many farmers will be impacted by the project?\n"},null,{"$f":"IFERROR(C6/C5,\"-\")","v":"-"}]
[null,{"$f":"Translate!$C$169","v":"TOTAL"},{"$f":"SUM(C5:C6)","v":0},{"$f":"C7/C4","v":{"$error":"#DIV/0!"}}]
["A2.0",{"$f":"Translate!$C$170","v":"What is the breakdown of farmers benefitting from the project by gender, socioeconomic delineation, and income?"}]
["A2.1",{"$f":"Translate!$C$171","v":"Male"},null,{"$f":"IFERROR(C9/(C9+C10),\"-\")","v":"-"}]
["A2.2",{"$f":"Translate!$C$172","v":"Female"},null,{"$f":"IFERROR(C10/(C9+C10),\"-\")","v":"-"}]
[null,{"$f":"Translate!$C$169","v":"TOTAL"},{"$f":"SUM(C9:C10)","v":0},{"$f":"C11/C6","v":{"$error":"#DIV/0!"}}]
["A2.3",{"$f":"Translate!$C$173","v":"Group type 1"},null,{"$f":"IFERROR(C12/($C$12+$C$13+$C$14+$C$15),\"-\")","v":"-"}]
["A2.4",{"$f":"Translate!$C$174","v":"Group type 2"},null,{"$f":"IFERROR(C13/($C$12+$C$13+$C$14+$C$15),\"-\")","v":"-"}]
["A2.5",{"$f":"Translate!$C$175","v":"Group type 3"},null,{"$f":"IFERROR(C14/($C$12+$C$13+$C$14+$C$15),\"-\")","v":"-"}]
["A2.6",{"$f":"Translate!$C$176","v":"Group type 4"},null,{"$f":"IFERROR(C15/($C$12+$C$13+$C$14+$C$15),\"-\")","v":"-"}]
[null,{"$f":"Translate!$C$169","v":"TOTAL"},{"$f":"SUM(C12:C15)","v":0},{"$f":"C16/C6","v":{"$error":"#DIV/0!"}}]
["A2.7",{"$f":"Translate!$C$177","v":"Unemployed"},null,{"$f":"IFERROR(C17/(C9+C10),\"-\")","v":"-"}]
["A2.8",{"$f":"Translate!$C$178","v":"Below poverty line"},null,{"$f":"IFERROR(C18/(C9+C10),\"-\")","v":"-"}]
[null,{"$f":"Translate!$C$169","v":"TOTAL"},{"$f":"SUM(C17:C18)","v":0},{"$f":"C19/C11","v":{"$error":"#DIV/0!"}}]
["A3.0",{"$f":"Translate!$C$179","v":"Where are farmers benefitting recruited from?"}]
{"$rows_left_out":26}
{"sheet":"3 OUTPUT-Graphs","index":3,"n_rows":33,"n_cols":13,"rows_kept":33,"cut":false,"hidden":false,"merged":[[0,1,0,12],[4,12,4,16],[5,12,5,16],[3,1,3,5],[4,1,4,5],[5,1,5,5],[3,12,3,16],[3,7,3,11],[4,7,4,11],[5,7,5,11]]}
[null,{"$f":"Translate!$C$202","v":"PROMOTE and INITIATE – Impact Assessment Tool"}]
[]
[]
[{"$f":"'1 INPUT-Checklist'!E4","v":"Project Name:"},{"$f":"'1 INPUT-Checklist'!G4","v":"sample"},null,null,null,null,null,{"$f":"'1 INPUT-Checklist'!E7","v":"Date of Impact Assessment:"},null,null,null,null,{"$f":"'1 INPUT-Checklist'!G7","v":0}]
[{"$f":"'1 INPUT-Checklist'!E5","v":"Project Location:"},{"$f":"'1 INPUT-Checklist'!G5","v":0},null,null,null,null,null,{"$f":"'1 INPUT-Checklist'!E8","v":"Project Duration (years):"},null,null,null,null,{"$f":"'1 INPUT-Checklist'!G8","v":0}]
[{"$f":"'1 INPUT-Checklist'!E6","v":"User Name:"},{"$f":"'1 INPUT-Checklist'!G6","v":0},null,null,null,null,null,{"$f":"'1 INPUT-Checklist'!E9","v":"Asset Lifespan (years):"},null,null,null,null,{"$f":"'1 INPUT-Checklist'!G9","v":0}]
[]
[]
[]
[]
[null,"Lowest score possible","Highest possible score","Actual Score","correction factor","% Reached",null,"<>N/A"]
[{"$f":"'1 INPUT-Checklist'!C4","v":"Population Change and Migration"},{"$f":"H12*-7.5","v":-52.5},{"$f":"H12*7.5","v":52.5},{"$f":"'1 INPUT-Checklist'!D4","v":52.5},{"$f":"120/C12","v":2.2857142857142856},{"$f":"(E12*'1 INPUT-Checklist'!D4)/120","v":1},null,{"$f":"COUNTIF('1 INPUT-Checklist'!$H$16:$H$22,\"<>N/A\")","v":7}]
[{"$f":"'1 INPUT-Checklist'!C5","v":"Women's Role"},{"$f":"H13*-7.5","v":-105},{"$f":"H13*7.5","v":105},{"$f":"'1 INPUT-Checklist'!D5","v":105},{"$f":"120/C13","v":1.1428571428571428},{"$f":"(E13*'1 INPUT-Checklist'!D5)/120","v":1},null,{"$f":"COUNTIF('1 INPUT-Checklist'!$H$24:$H$37,\"<>N/A\")","v":14}]
[{"$f":"'1 INPUT-Checklist'!C6","v":"Minority and Indigene Groups"},-45,{"$f":"H14*7.5","v":45},{"$f":"'1 INPUT-Checklist'!D6","v":45},2.6666666666666665,{"$f":"(E14*'1 INPUT-Checklist'!D6)/120","v":1},null,{"$f":"COUNTIF('1 INPUT-Checklist'!$H$39:$H$44,\"<>N/A\")","v":6}]
[{"$f":"'1 INPUT-Checklist'!C7","v":"Income and Amenities"},-52.5,{"$f":"H15*7.5","v":52.5},{"$f":"'1 INPUT-Checklist'!D7","v":52.5},2.2857142857142856,{"$f":"(E15*'1 INPUT-Checklist'!D7)/120","v":1},null,{"$f":"COUNTIF('1 INPUT-Checklist'!$H$46:$H$52,\"<>N/A\")","v":7}]
[{"$f":"'1 INPUT-Checklist'!C8","v":"Regional Effects in Country"},-67.5,67.5,{"$f":"'1 INPUT-Checklist'!D8","v":67.5},1.7777777777777777,{"$f":"(E16*'1 INPUT-Checklist'!D8)/120","v":1},null,{"$f":"COUNTIF('1 INPUT-Checklist'!$H$54:$H$62,\"<>N/A\")","v":9}]
[{"$f":"'1 INPUT-Checklist'!C9","v":"User Involvement"},-37.5,37.5,{"$f":"'1 INPUT-Checklist'!D9","v":37.5},3.2,{"$f":"(E17*'1 INPUT-Checklist'!D9)/120","v":1},null,{"$f":"COUNTIF('1 INPUT-Checklist'!$H$64:$H$68,\"<>N/A\")","v":5}]
[{"$f":"'1 INPUT-Checklist'!C10","v":"Natural Resources and Environment"},-172.5,172.5,{"$f":"'1 INPUT-Checklist'!D10","v":172.5},{"$f":"120/C18","v":0.69565217391304346},{"$f":"(E18*'1 INPUT-Checklist'!D10)/120","v":1},null,{"$f":"COUNTIF('1 INPUT-Checklist'!$H$70:$H$92,\"<>N/A\")","v":23}]
[]
[]
{"$rows_left_out":14}
{"sheet":"Translate","index":4,"n_rows":300,"n_cols":7,"rows_kept":300,"cut":false,"hidden":false,"merged":[[1,1,2,2],[4,1,4,8],[6,1,10,1]]}
[]
[null,{"$f":"$C$13","v":"Do not modify this sheet"}]
[]
[]
[null,{"$f":"$C$14","v":"Reference Row"}]
[null,{"$f":"$C$15","v":"Selected Language:"},{"$f":"'READ ME'!$G$11","v":"English"},"English","Français","Español","العربية"]
[null,{"$f":"$C$16","v":"Sheet name"},{"$f":"HLOOKUP($C$6,$D$6:$I$593,ROW()-ROW($B$5),FALSE)","v":"READ ME"},"READ ME","LISER MOI","LÉEME","اقرأ هذه الصفحة"]
[null,null,{"$f":"HLOOKUP($C$6,$D$6:$I$593,ROW()-ROW($B$5),FALSE)","v":"1 INPUT-Checklist"},"1 INPUT-Checklist","1 ENTRÉES-Fiche de controle","1 ENTRADA-Lista de verificación","1 المدخلات - قائمة التحقق"]
[null,null,{"$f":"HLOOKUP($C$6,$D$6:$I$593,ROW()-ROW($B$5),FALSE)","v":"2 INPUT-Data"},"2 INPUT-Data","ENTRÉES-Données","2 ENTRADA-Datos","2 المدخلات - البيانات"]
[null,null,{"$f":"HLOOKUP($C$6,$D$6:$I$593,ROW()-ROW($B$5),FALSE)","v":"3 OUTPUT-Graphs"},"3 OUTPUT-Graphs","SORTIES-Graphiques","3 SÁLIDA-Gráficos","3 النتائج - الرسوم البيانية"]
[null,null,{"$f":"HLOOKUP($C$6,$D$6:$I$593,ROW()-ROW($B$5),FALSE)","v":"Translate"},"Translate","Traduire","Traducción","ترجمة"]
[]
[null,{"$f":"$C$11","v":"Translate"},{"$f":"HLOOKUP($C$6,$D$6:$I$593,ROW()-ROW($B$5),FALSE)","v":"Do not modify this sheet"},"Do not modify this sheet","Ne modifiez pas cette feuille","No modifique esta hoja","لا تعدل هذه الصفحة"]
[null,null,{"$f":"HLOOKUP($C$6,$D$6:$I$593,ROW()-ROW($B$5),FALSE)","v":"Reference Row"},"Reference Row","Ligne de référence","Fila de referencia","صف مرجعي"]
[null,null,{"$f":"HLOOKUP($C$6,$D$6:$I$593,ROW()-ROW($B$5),FALSE)","v":"Selected Language:"},"Selected Language:","Langue sélectionnée:","Idioma seleccionado:","اللغة المختارة:"]
[null,null,{"$f":"HLOOKUP($C$6,$D$6:$I$593,ROW()-ROW($B$5),FALSE)","v":"Sheet name"},"Sheet name","Nom de la feuille","Nombre de la hoja","اسم الصفحة"]
[]
[null,{"$f":"$C$7","v":"READ ME"},{"$f":"HLOOKUP($C$6,$D$6:$I$593,ROW()-ROW($B$5),FALSE)","v":"Select language"},"Select language","Sélectionner la langue","Seleccione el idioma","اختار اللغة"]
[null,null,"Read Me Sheet","Read Me Sheet","Feuille Lisez-moi","Léeme","اقرأ هذه الصفحة"]
[null,null,"PROMOTE and INITIATE – Impact Assessment Tool","PROMOTE and INITIATE – Impact Assessment Tool","PROMOTION et INITIATION - Outil d’évaluation d’impact","PROMUEVE – Herramienta de evaluación de impacto","الترويج و المبادرة - أداة تقييم الأثر"]
{"$rows_left_out":281}
{"sheet":"VERSION CONTROL","index":5,"n_rows":22,"n_cols":5,"rows_kept":22,"cut":false,"hidden":true,"merged":[[8,4,8,7],[8,2,8,3],[20,3,20,7],[9,3,11,7],[13,2,13,3],[13,4,13,6],[14,2,14,3],[14,4,14,6],[15,2,15,3],[15,4,15,6],[17,3,17,7],[18,3,18,7],[19,3,19,7],[27,3,27,7],[21,3,21,7],[22,3,22,7],[23,3,23,7],[24,3,24,7],[25,3,25,7],[26,3,26,7]]}
[]
[]
[]
[]
[]
[]
[]
[]
[]
[null,null,null,"Tranlsation of ICID Checklist for Socioeconomic perspectives for SPIS projects"]
[]
[]
[]
[null,null,"Created By",null,"Alqayam Meghji"]
[null,null,"Checked By",null,"Lucie Pluschke"]
[null,null,"Reviewed By"]
[]
[null,"Date","Rev:","Comments"]
[null,"19/03/18",0.1,"Draft for review"]
[null,"23/03/18",0.2,"Inclusion of equity and efficieny"]
{"$rows_left_out":3}
{"sheet":"Reference","index":6,"n_rows":30,"n_cols":7,"rows_kept":30,"cut":false,"hidden":true,"merged":[]}
["Impact","Score YES","Score NO"]
[{"$f":"Translate!$C$152","v":"Positive impact is very likely"},5,1]
[{"$f":"Translate!$C$153","v":"Positive impact possible"},2,1]
[{"$f":"Translate!$C$154","v":"No impact likely"},1,1]
[{"$f":"Translate!$C$155","v":"Negative impact possible"},-2,4]
[{"$f":"Translate!$C$156","v":"Negative impact very likely"},-5,5,null,null,null,{"$f":"B6*B9*B15","v":7.5}]
[]
["Weighting","Linear Multiplier"]
[{"$f":"Translate!$C$149","v":"High"},1.5]
[{"$f":"Translate!$C$150","v":"Medium"},1]
[{"$f":"Translate!$C$151","v":"Low"},0.5]
[]
["Weighting","Linear Multiplier"]
[{"$f":"Translate!$C$146","v":"Yes"},1]
[{"$f":"Translate!$C$147","v":"No"},-1]
[{"$f":"Translate!$C$148","v":"N/A"},{"$f":"Translate!$C$148","v":"N/A"}]
[]
["Questions"]
["https://ec.europa.eu/agriculture/publi/reports/sustain/index_en.pdf  "]
[]
{"$rows_left_out":10}